“Solución de error de matriz de confusión” Código de respuesta
Respuestas similares a “Solución de error de matriz de confusión”
Preguntas similares a “Solución de error de matriz de confusión”
-
ParserError: error de tokenización de datos. E Error: los campos esperados 1 en la línea 87, Saw 2
-
Error de validación de importación en Django
-
Error de instalación de PIP
-
ADVERTENCIA: Hubo un error revisando la última versión de PIP.
-
número de conteo de islas matriciales python
-
Cómo imprimir error en intento excepto python
-
Importar error de registro cuadrado medio
-
Python obtenga un número de error de línea
-
Matriz inversa Python
-
Dotenv Error Pip Python
-
Spacy ERROR EN_CORE_WEB_SM
-
Python excepto el error como e
-
Desde Sklearn.Cross_Validation Import Train_test_split Error
-
Error al cuadrado medio Python
-
Transponer una matriz utilizando la comprensión de la lista
-
Divide por error cero Python Exception Manipling
-
Error de CORS en Flask
-
Error de pandas Tokenizing Data.
-
Encuentre la solución de puntaje de finalización en Python3
-
Visualizar Matriz de correlación Python
-
Matrix Pow Python
-
Matriz de covarianza Python
-
Seleccione el elemento aleatorio de la matriz
-
Error de antorcha de instalación de PIP
-
Importar error absoluto medio
-
Solución FizzBuzz Python
-
urllib.error.urlerror:
-
Error SSL de transmisión por línea
-
SEABOR crea una matriz de correlación
-
Sklearn Error de cuadrado medio
-
Trace de error de impresión de Python
-
Generar Matrix Python
-
matriz de concat de antorcha
-
Python crea una matriz con una en diagonal
-
Python init Matrix
-
Notebook Jupyter Cómo configurar las columnas de la fila de MAX Matrix Numpy
-
Python Error Get Line
-
Error del servidor 500 Heroku Django
-
Cómo agregar filas a una matriz numpy
-
Matriz de identidad en Python
-
Error del matraz
-
Manejo de errores en Python usando Flask
-
Frasco de manejo de errores
-
trazado de matriz matplotlib
-
Cómo encontrar a los vecinos de un elemento en Matrix Python
-
Flower no implementado error
-
Convertir la matriz de transformación para plantear ROS
-
Error emergente en django no visible
-
Error de Python Magic Windows
-
Rotar la matriz 90 grados en el sentido de las agujas del reloj Python
-
Matrix Python
-
CodeForce 4C Solución en Python
-
Discord.py en error de comando
-
error de certificado de python twilio
-
Manejo de errores del conector de copo de nieve
-
de Sklearn.PrecoSing Import StandardsCaler Error
-
CodeForces 677A Solución
-
CodeForces 677a Python Solution
-
Impresión de matriz Eleme
-
Error de importación en el mismo directorio Python
-
El error de la clave extranjera de Django no puede asignar debe ser una instancia
-
El error fatal detectado no pudo ejecutar script
-
MIMETYPE ERROR DJANGO REACT
-
Columna de retorno de Matrix Numpy
-
Tensorflow no instalando error
-
Plantilla de error de renderizado
-
determinante de una matriz en Python
-
porcentaje de error absoluto medio Python
-
Error advertencia tkinter
-
Calcule la raíz Error cuadrado medio Python
-
Model.Predict ([x_test]) Error
-
Cómo agregar dos matriz usando la función en Python
-
Reemplace el error con nan pandas
-
Python crea n*n matriz
-
SQLITE Error operacional No hay tal columna
-
trazado de la barra de error Python
-
Error de canal no disponible en condena
-
Generar Matriz Integer Random Python
-
Error de instalación de Pyaudio Ubuntu
-
Error fatal en el lanzador: no se puede crear el proceso
-
Numpy crea una matriz de cierto valor
-
de matriz a array python
-
Error Urllib Solicitar ningún atributo
-
Cómo tomar la entrada de matriz del usuario en Python
-
función numpy para el cálculo inverso de una matriz
-
longitud de una matriz en Python
-
Matriz de correlación Python
-
Ignorar Error Abrir archivo Python
-
máximo de matriz numpy
-
declarar numpy ceros matrix python
-
ParserError: error de tokenización de datos. E Error C: esperados 1 campos en la línea 6, Saw 3
-
matriz numpy
-
Matriz de copia profunda de NP
-
Error de captura Python
-
Pequeña solución factorial de CodeChef
-
El origen remoto ya existe un error git
-
Error de servidor interno 500 Flask de Python
-
Respuesta de error de retorno del frasco
-
Cómo convertir una imagen en matriz en Python
-
Convertir la imagen en Matrix Python
-
Skip Error Python
-
Iniciar Matrix Python con ceros
-
Moviewriter stderr: ffmpeg: error al cargar bibliotecas compartidas: libopenh264.so.5: No se puede abrir el archivo de objeto compartido: no hay dicho archivo o directorio
-
Error de juego
-
Error de juego Python
-
Matriz de adyacencia de Igraph Python
-
Matriz de distancia en Python
-
normalizar filas en matriz numpy
-
elevar un error de API en la vista de descanso de Django
-
archivos estáticos que no cargan 404 error django
-
El comando de error errado con el estado de salida 1 face_recognition
-
Crear Python de matriz cuadrada
-
Cómo imprimir una matriz en Python
-
multiplicación de matriz tensorflow
-
Cómo encontrar la transposición de una matriz en Python
-
Python Archivo Abrir intento excepto error
-
Cómo crear una matriz usando Python
-
Catch Data de error con excepto Python
-
Cómo convertir la lista de adyacencia a la matriz de adyacencia
-
Cómo crear matriz de adyacencia a partir de la lista de adyacencia en Python
-
urllib.error.urlerror:
-
Error de PIP install Pywhatkit
-
Manejo de errores de Python
-
Seaborn Barplot elimina las barras de error
-
Multiplicación de matriz nupy
-
Python Numpy Matrix a la lista
-
trama de matriz de dispersión
-
Salida de error de impresión de Python
-
Mensaje de error de Windows Python
-
Determinante de la matriz en Python
-
Error de Mod_wsgi de PIP install
-
Sume todos los valores en una pitón matriz
-
Error de chatbot de Python
-
Matriz de correlación de Python de características
-
Matriz inversa Python Numpy
-
Puppy y Sum CodeChef Solución
-
Error de tipo de impresión Python
-
intente excepto el error de decodificación JSON
-
Mientras activaba envé, muestra un error de acceso a no ya -utorize en VScode
-
Cómo obtener la primera columna en todas las filas de una matriz 2D en Python
-
matriz inversa numpy
-
Convertir la lista de listas en matriz de matriz numpy
-
Error de captura en Mongo Query Python
-
231A CodeForces Solution en Python
-
Matriz de transposición en Python sin numpy
-
Python verifica si la entrada () da error
-
matrices de trama de Python de Matrix
-
Imprima la norma de un vector y una matriz usando Numpy.
-
Cómo acceder a todos los elementos de una matriz en Python usando para bucle
-
Cómo omitir el error Python
-
matriz de pitón
-
Solución CODECHEF de primer y último dígito
-
Transposición de una matriz en Python Numpy
-
Obtener columna o fila de matriz Numpy Python
-
Matriz diagonal suma leetcode
-
Matriz diagonal suma Leetcode en Python
-
Matriz diagonal Sum Python
-
suma diagonal de la matriz Leetcode en Python
-
Matriz diagonal suma leetcode en java
-
Matriz de correlación de pandas entre una columna y todos los demás
-
Matriz Python inversa sin numpy
-
Matriz de correlación de Pands a DataFrame
-
Manejo de errores de frasco
-
Gire la matriz 90 grados en el sentido
-
Rotar Matriz Python
-
Rotación de matriz en Python
-
traza matriz como mapa de calor
-
Python dada la construcción del triángulo superior de la matriz simétrica
-
Frasco de la página de error de edición
-
Elemento eliminar de Matrix Python
-
Cómo personalizar el mensaje de respuesta de error SimpleJWT en Django Restframework
-
importar pycocotools._mask como _Mask Error esperado 80, obtuvo 88
-
Gurobi obtiene una solución factible cuando alcanzó el tiempo de tiempo
-
Tabla de error de Django ya existe
-
Cómo matar un script si el error es presionado python
-
Error de personaje de Python Unicode
-
iterar sobre filas en numpy matriz python
-
Desde imblearn.over_sampling Error de smote de importación
-
Error de sesgo medio
-
navegador = webdriver.firefox () Error
-
Inverso de una matriz con determinante 0 python linalg
-
Python Zigzag Una matriz para DCT
-
multiplicación de matriz de backend keras
-
numpy ndarray a matriz
-
Instale el error de PocketSphinx
-
SystemError: retorno de error sin excepción establecida
-
advertencias de Python como error
-
hwo a excepto todos los errores en Python Pry Statemen
-
Python Agregar columna a una matriz
-
Error de 400 Error Python
-
Error de conversión de Python Catch int
-
una función para crear una matriz nula en Python
-
Python Crear matriz nula
-
Función Python Crear matriz nula
-
Obtenga N valores más grandes de la matriz de matriz Numpy 2D
-
Python combina dos columnas en matriz
-
Python combina dos listas en Matrix
-
Matriz de identidad con Numpy
-
columna np matriz caída cero
-
Gire la matriz 90 grados en el sentido de las agujas del reloj en Python
-
Error de Python
-
Error de importación circular
-
Error Python
-
Error de sintaxis de Python Jedi
-
RuntimeError: Error en el cálculo de la triangulación de Qhull Delaunay: datos de entrada singular (ExitCode = 2); Use la opción Python Levet (-V) para ver el error Qhull original.
-
Pandas MySQL Error en consulta concats con el espacio
-
formar una matriz chakravyuh python
-
Error de sangría en el editor de Python Atom
-
Error fuera de uno en Python
-
Error de la bifurcación de Python
-
1007 Solución Python
-
Cómo tomar la entrada una matriz usando mapa en Python
-
Error en el comando de configuración de matplotlib: use_2to3 no es válido
-
Error de objeto httpponse en View.py
-
Colab no entrenando siempre dando a CUDA Error fuera de memoria.
-
ValueError: matriz dispersa esperada con valores enteros, valores de flotación encontrados
-
Error absoluto medio en la fórmula de aprendizaje automático
-
Continsduplicate set Solution
-
Manejo de errores de valor
-
Error cero
-
La aplicación Django WSGI no se pudo cargar error de importación del módulo
-
Agregar en el diccionario con valores de matriz
-
SNS NAN MATRIX
-
Error de sangría Python
-
Mak una matriz escasa de CSR Scipy
-
matriz de matrices python grepper
-
error adicional
-
remodelar la matriz IML
-
Recopilación de dulces CodeVita Solución en Python
-
Error de Python DT solo se usa con valores de DataTimElike
-
Cómo hacer referencia a la segunda línea de matriz en Python
-
Fragmento para una matriz inversa usando numpy
-
Error al cuadrado medio en la fórmula de aprendizaje automático
-
Matriz Producto exterior Python
-
El PD no está definido por error de Python
-
Bar Plot Seborn sin barras de error
-
Django Brutebuster Error falló intentos
-
ConfigParser Error al leer la ruta del archivo relativo
-
1041 Solución URI
-
Django dos kilómetros extranjeros al mismo error de administrador del modelo
-
Error 302 Heroku Django
-
remodelar matriz SAS
-
Agregue un conjunto de datos de matriz de tercera dimensión Python
-
Sub Matrix Python
-
convertir una imagen en matriz en python
-
Números de generación de Python según una matriz de corelación
-
Manejo de errores de Django
-
Error de dominio de matemáticas Python
-
Obtener el tamaño de la matriz cuadrada Python
-
Excepción de error de valor
-
Error cuadrado medio de raíz en la fórmula de aprendizaje automático
-
Matriz de precisión usando NP truncando la salida
-
extraer una subparte de una matriz
-
Error de excepción de Python vs
-
implemento matriz
-
Len de matriz cuadrada
-
transmisión de matriz de distancia euclidiana numpy
-
Lucky Four Codechef Solución
-
Cómo acceder al índice específico de matriz en Python
-
Python de entrada de matriz de personajes
-
Error de condición previa TensorFlow Predicta
-
Error de OpenCV [Warn: 0] Terminar la devolución de llamada de Async
-
1042 Solución URI
-
Uso de matriz numpy en Tkinter Python 3
-
ERROR DEL PERMEDIO_HOSTS ECS DJANGO
-
Django Error que muestra la página de imágenes no encontrada
-
Suma de dos diagonales en Matrix
-
Init Matrix en Numpy
-
La escalera más grandiosa de todas las solución de Foobar
-
Error de verificación de archivo de archivo de Python
-
Slack Bot Error no_in_channel
-
Crear matriz con pitón complejo
-
Cree una matriz a partir de una gama de números (usando Arange)
-
matriz de extracto de django de la matriz posterior
-
Encuentre suma de todos los elementos en una matriz de Python
-
Error de cromedriver no detectado de selenio
-
Currelation Matrix Python
-
Reemplace los valores de matriz Python
-
trazar un dendrograma desde la matriz de distancia
-
Py Draw Matrix of Black Square y White Circle
-
Valor de la matriz de acceso OpenCV
-
Suma de elementos diagonales de una pitón matriz sin numpy
-
¿Cómo agrego dos matriz y la guardo en una lista en Python?
-
Error vacío de Python Multiprocessing Queu
-
Solución para eliminar la limitación de recursión en Python
-
Python Sum Whole Matrix Comand
-
Error de flotación Python
-
Transpose la matriz 3D pytorch
-
corrige el error cuando cierra la pantalla de tortuga en tu propio bucle principal
-
Matriz de distancia Gogle Map Python
-
CodeForces 233 una solución python
-
Norma 2 o Ocklidos de la matriz en Python
-
Matriz de dispersión de Python con línea de regresión
-
elevar httperror (req.full_url, código, msg, hdrs, fp) urllib.error.httperror: http error 429: demasiadas solicitudes
-
Uso de la biblioteca de rastreo de anillo para pasar un error
-
Solución Polycarp y Coins CodeForces
-
Python Escribir al flujo de errores
-
Python NLTK Error de búsqueda Recurso OMW-1.4 no encontrado.
-
Devu y prueba de amistad Solución CODECHEF
-
Pantalla de tortuga Cerrar corrección de error
-
Error de dictes múltiples
-
diccionario, aceptando una solución de palabras similares
-
Error de Python Synta
-
Error de región cuando se usa la cuenta de servicio JSON File DatapROC
-
Esta línea es obligatoria para agregar en cualquier momento que desee usar la biblioteca PyGame. Debe agregarse antes de cualquier otra función de pygame, de lo contrario, puede ocurrir un error de inicialización.
-
Error de selenio 403 Python
-
Convertir series de tiempo a la matriz de transición
-
Visual Studio Code Pylint: Error cuando todo está bien
-
Cómo ejecutar Matrix en Python
-
Cómo tomar la entrada de matriz en Python
-
Django REST Framework Relación de clave externa Error en serializador
-
Python Derivative del error cuadrático medio
-
Error de DataProc Initialization_actions
-
Conteo de matriz y nnumpy valores no negativos
-
Captura de scrape: descarga de errores
-
Python Error Captura de módulos
-
Cadena de Python: error de índice
-
Obtener falsos positivos de la matriz confusa
-
La columna de error de Django last_login no puede ser nula
-
Error de análisis ASN1 al intentar conectarse a Mongo Atlas
-
Error HTTP 403: Correo electrónico de registro de la cuenta de Django Prohibido
-
Cómo formatear una matriz para alinear todas las filas Python
-
Python Numpy ASArray_ChkFinite Función Ejemplo aumenta el error de valor
-
Enorme prueba de prueba de entrada CODECHEF
-
Oauthlib Python Error
-
Similiaridad de coseno de un vector con otros vectores en una matriz
-
Adjunto de matriz 3x3 en Python
-
escribo nano en python y obtengo error
-
Marco de descanso de error de atributo
-
Matriz de Networkx para gráficos
-
Matriz de Python condensada en cuadrado
-
error de permiso
-
Ajustación de matriz 3x3 en Python
-
Si el error de la función grepper
-
1043 Solución URI
-
Agregar mensaje de error en django loginrequiredmixin
-
Cálculo de error R-cuadrado y MNSE
-
Error HTTP 403: Django prohibido usando sendGrid
-
Los enteros vienen en todos los tamaños en Python3
-
La función se usa para calcular una de las ocho normas de matriz diferentes o una de las normas vectoriales en Numpy
-
1036 Solución Python
-
¿Qué significa cuando recibo un error de permiso en Python?
-
Adjunto de 3x3 matriz en numpy
-
Python intitializa una matriz 2D
-
Error estándar de la media
-
1044 Solución URI
-
Python 2d matriz declarar
-
Transpose Matrix Python
-
Python Pyaudio Error
-
Transponer una matriz en Python
-
Error unicode Python
-
Error de valor de Python
-
Encontrar el elemento máximo de una matriz con python numpy.argmax ()
-
Matriz de Python Determinante sin Numpy
-
Python Escribir error al archivo
-
Django Forms Error personalizar
-
La estética de error debe ser de longitud 1 o lo mismo que los datos (3) rellenar
-
Cómo crear una matriz de la lista en Python
-
Corrección de errores del código
-
Matriz inversa Gauss Python
-
Error de Unocodo Pytonn
-
Python que devuelve filas y columnas de una cadena de matriz
-
1038 Solución Python
-
Más respuestas relacionadas con “Solución de error de matriz de confusión” en Python
-
Python RuntimeError: tf.placeholder () no es compatible con la ejecución ansiosa.
-
XLRDERROR: archivo Excel XLSX; No soportado
-
pytube.exceptions.regexMatchError: get_throttling_function_name: no pudo encontrar coincidencia para múltiples
-
ValueError: TZ-AWARE DateTime.Datetime no se puede convertir a Datetime64 a menos que UTC = verdadero sitio: stackoverflow.com
-
Línea de comandos ambientaletror
-
PACKAGSNOTFoundError: los siguientes paquetes no están disponibles en los canales actuales: - Python == 3.6
-
ls.ProgrammingError: permiso denegado para la tabla django_migrations
-
Importor: ningún módulo llamado Builtins
-
AttributeRorRor: esta instancia de consulta es django inmutable
-
ImporterRor: el módulo dinámico no define la función de exportación de módulos (pyinit_cv_bridge_boost)
-
ImporterRor: No se puede importar el nombre de JSON de ItsDangero
-
pandas no tiene atributo scatter_matrix
-
SyntaxError: código no UTF-8 que comienza con
-
Importor: ningún módulo llamado django.core.wsgi
-
ValueError esperado La matriz 2D obtuvo una matriz 1D en lugar de una regresión lineal de Python
-
RuntimeError: intentar deserializar el objeto en un dispositivo CUDA pero atorch.cuda.is_available ()
-
FIJO IMPORTERROR: Ningún módulo llamado PIL
-
keyError dismido_count Pafy
-
Lookuperror: Codificación desconocida: Idna Python
-
RecursionerRor Máxima profundidad de recursión
-
Importor: ningún módulo llamado user_agent
-
Importador: no podría
-
AssertionError: el campo relacional debe proporcionar un argumento `QuerySet`, anular` get_queryset` o establecer read_only = `true
-
para E en p.event.get (): pygame.error: sistema de video no inicializado
-
ValueError: no se pudo convertir una matriz numpy a un tensor (flotador de tipo de objeto no compatible).
-
manejar errores en el frasco
-
Autorror de frascos
-
_CSV.Error: campo mayor que el límite de campo (131072)
-
Cómo cambiar la resolución de captura de OpenCV
-
Error de python2 iónico: no encontrado: python2
-
flor de apio NotimplementError
-
cv_bridge.core.cvbridgeError: [8uc4] no es un formato de color. Pero [BGR8] es. La conversión no tiene sentido
-
Python especificar la salida de typeError
-
Python/Docker ImporterRor: No se puede importar el nombre JSON de ItsDangero
-
dividir por cero errores al usar anotar
-
Entrada de nombre de Python
-
ValueError: Numpy.ndArray Tamaño cambiado, puede indicar incompatibilidad binaria. esperado 88 del encabezado C, obtuvo 80 de Pyobject
-
ValueError: puede haber como máximo 1 encabezados sujetos en un mensaje
-
python trapt_confusion_matrix
-
Hacer soluciones más rápidas en Python
-
Oserror: no se puede escribir en modo RGBA como JPEG Python
-
Importor: ningún módulo llamado _bootlocale
-
FutureWarning: Imagen de entrada dtype es bool. La interpolación no se define con el tipo de datos de bool. Establezca el pedido en 0 o explícitamente la imagen de entrada a otro tipo de datos. A partir de la versión 0.19 se planteará un ValueError en lugar de esta advertencia.
-
smtpauthenticationError
-
ValueError: los logits y las etiquetas deben tener la misma forma ((ninguna, 1) vs (ninguno, 2))
-
[Resuelto] typeError: no se puede multiplicar la secuencia por no intento de type str
-
WinError 5 Access se niega PIP
-
TypeError: Sitio de objeto de cadena esperada o bytes: stackoverflow.com
-
ImporterRor: libgl.so.1: No se puede abrir el archivo de objeto compartido: no hay dicho archivo o directorio
-
Emisión de pandas typeError: no hay datos numéricos para trazar
-
Resolución de SaveFig
-
Exportar alta resolución .png matplotlib
-
Matploltib Aumento de la resolución
-
django.db.utils.operationalError: no hay tal tabla:
-
ImporterRor: no se puede importar el nombre ABC
-
Error: la rueda de construcción fallida para almohada
-
SSL.SSLCertVerificationError: [SSL: certificate_verify_failed] Verificar el certificado Falta: No se puede obtener el certificado del emisor local (_ssl.c: 1091)
-
Importor: ningún módulo llamado EasyDict
-
TypeError: las excepciones deben derivar de BaseException
-
SystemError: el mosaico no puede extenderse la imagen externa
-
Cambiar la almohada de resolución de imagen
-
UnboundLocalError: variable local
-
Importor: ningún módulo llamado _tkinter, instale el paquete python-tk
-
Error del sistema operativo: conexión rechazada, errno = 111, dirección = 127.0.0.1, puerto = 43350
-
import sklearn.metrics de plot_confusion_matrix
-
Error de CUDA: afirmación del lado del dispositivo activado
-
ValueError: `logits` y` etiquetas` deben tener la misma forma, recibida ((ninguno, 2) vs (ninguno, 1)).
-
TypeError: los objetos unicode se deben codificar antes del hash
-
TypeError: no puede desempaquetar el objeto int no iterable
-
Python ignora unicodedecodeerror
-
Importador: el módulo dinámico no define la función de exportación de módulos
-
ImporterRor: no hay solicitudes de módulo con nombre
-
Importador: ningún módulo llamado Flask
-
RuntimeError: Broken Toolchain: no se puede vincular un programa C simple C
-
ValueError: con n_samples = 0, test_size = 0.2 y Train_size = None, el conjunto de tren resultante estará vacío. Ajuste cualquiera de los parámetros antes mencionados.
-
NameError: el nombre PD no está definido
-
Importador: ningún módulo llamado Colored
-
DataFrame KeyError:
-
Problema typeError: no puede multiplicar la secuencia por no intento de tipo STR
-
TypeError: secuencia elemento 0: instancia str esperada, int encontrado
-
Importador: la carga DLL falló al importar Win32File: no se pudo encontrar el módulo especificado.
-
Importador: la carga DLL falló al importar Win32API: no se pudo encontrar el procedimiento especificado.
-
ValueError: formas (ninguna, 1) y (ninguno, 11) son keras incompatibles
-
TypeError: forma inválida (3, 32, 32) para datos de imagen
-
ValueError: columnas se superpone pero no hay sufijo especificado:
-
TypeError: el objeto float no se puede llamar
-
Taberror: uso inconsistente de pestañas y espacios en la muescas
-
IndexError: índice no válido de la variable escalar.
-
ValueError: matriz encontrada con DIM 3. Estimador esperado
-
Problema AtributeError: Numpy.ndArray Object no tiene un índice de atributo
-
Error: Wheel de construcción fallida para Python-LDAP
-
TypeError: strptime () argumento 1 debe ser str, no series
-
intente excepto keyError
-
UnicodeDecodeError UTF8 Codec Cant Decode Byte Byte Pandas
-
SognationError: sangría inesperada
-
UnicodeDecodeError: UTF8 Codec Cant Decode Byte
-
Ignorar errores o advertencias de pytest
-
Cómo registrar errores mientras la depuración es falsa en django
-
archivo unicodeDecodeError leído
-
python criar typeError
-
Cómo arreglar ValueError en Python
-
AT = Código de error = H10 DESC = APP Crasado Python Flask
-
Imprimir etiquetas en confusion_matrix
-
xml.parsers.EXPAT.EXTERROR: no bien formado (token inválido): línea 1, columna 0
-
SyntaxError: el argumento posicional sigue el argumento de palabras clave
-
sqlite3.programmingError: número incorrecto de enlaces suministrados. La declaración actual usa 1, y hay 7 suministrados.
-
FileExistsError: [ERRNO 17] El archivo existe:
-
No se encuentra la aplicación de Python, verifique sus registros de inicio en busca de errores
-
Error: el comando erróneo con el estado de salida 1
-
Error: getAddrinfo enotfound www.python.org www.python.org:443 Descargar Python falló. Error: {Error: getAddrinfo enotfound www.python.org www.python.org:443
-
convertir nDarray a csr_matrix
-
ImporterRor: no se puede importar el nombre incluir
-
Error: no bien formado (token no válido)
-
Por qué Pytest no devuelve el módulo
-
Eoferror: eof al leer una línea
-
Desde django.core.management import execute_from_command_line ImporterRor: ningún módulo llamado django.core.management
-
IntegrityError Import en Django
-
IntegrityError
-
pytube obtenga la mayor resolución
-
OSError: [ERRNO 98] Dirección ya en uso
-
Oserror: enlace de servicio cruzado no válido
-
ValueError: la dimensión de datos de consulta debe hacer coincidir la dimensión de datos de entrenamiento
-
ValueError: no se puede remodelar la matriz del tamaño 98292 en forma (16382,1,28) Sitio: stackoverflow.com
-
ValidationError Django Params
-
Obtuve AttributeRorror al intentar obtener un valor para el campo Nombre` en Serializer
-
ValueError: Literal no válido para int () con base 10: Sitio: stackoverflow.com
-
submatriz de Python
-
Obtener la resolución de la imagen Python
-
Python ValueError: matriz de tamaño cero a operación de reducción máxima que no tiene identidad
-
BasesshtunnelforwarderError: no pudo establecer sesión en SSH Gateway
-
¿Qué son los errores de postcondición en Python?
-
Python Habilitar errores de Pyqt
-
Python Wifi Moudel [WinError 2] El sistema no puede encontrar el archivo especificado
-
de sklearn.metrics import confusion_matrix pred = model.predict (x_test) pred = np.argmax (pred, axis = 1) y_true = np.argmax (y_test, axis = 1)
-
Leetcode Solutions Python
-
Sqlalchemy IntegrityError
-
Resolución de imagen Extracción de pitón
-
RuntimeError: configure el modo de numeración de pin usando gpio.setmode (gpio.board) o gpio.setMode (gpio.bcm)
-
Python eleva FileNotfoundError
-
error de tecleado:
-
TypeError: el objeto de tipo dictproxy no es serializable
-
excepto filenotfoundError
-
django.db.utils.integrityError:
-
Python Global Variable UnboundLocalError
-
TypeError: DICT no es una secuencia
-
Error de instalación de la tubería de medios: no pudo encontrar una versión que satisfaga el requisito MediaPipe (de versiones: ninguno)
-
PermissionError: [Errno 13] Permiso denegado en Flask
-
ModulenotfoundError: no se nombra módulo
-
Importor: ningún módulo llamado Pandas
-
TypeError: está prohibida la asignación directa al lado directo de un conjunto de muchos a muchos. Use .set () en su lugar
-
entrevista con soluciones de preguntas de Python
-
MultivaluDictKeyError django
-
django-multivalueDictKeyError-error
-
typeError: objeto esperado Str, bytes u Os.
-
Errores de registro en correos electrónicos
-
Python Screen Info Resolution Multi-Monitor Multi-Screen
-
plt.imshow typeError dimensiones no válidas para datos de imagen
-
Cómo atrapar el cudastero
-
Manejo de errores mientras usa el método OS.MakedIrs ()
-
AttributeRorRor: módulo
-
Cómo ingresar un carácter de cadena en un numpy ceros imatrix n python
-
de sklearn.metrics importan mean_square_error
-
Python Import Cache (prueba de Grepper, tal vez no sea una solución útil)
-
Error de pitón fatal: no se puede recuperar del desbordamiento de la pila.
-
El comando planteó una excepción: typeError: discord.py
-
sqlite3.operationalerRor no hay tal versión de columna
-
RuntimeError: Objeto esperado de tipo Torch.floattensor pero se encuentra tytorch.cuda.floattensor para el argumento
-
Errores de sintaxis de Python
-
[Resuelto] pandas typeError: no hay datos numéricos para trazar
-
ValueError: Y_true y Y_Pred contienen diferentes números de clases 6, 2. Proporcione las etiquetas verdaderas explícitamente a través del argumento de etiquetas. Clases encontradas en y_true: [0 1 2 3 4 5]
-
** (argumenterRor) Las listas en Phoenix.html y las plantillas solo pueden contener enteros que representan bytes, binarios u otras listas, obtuvieron entrada no válida:
-
El valor no es un dict (type_error.dict) válido (type_error.dict) Respuesta_Model Fastapi
-
django.db.utils.ingrityError: no la restricción nula falló
-
Cómo obtener una resolución JPEG en Python
-
Cómo resolver los errores de importación mientras intenta implementar el frasco usando WSGI en Apache2
-
Errores que obtendrá durante el objeto de fecha en Python DateTeMe
-
django.db.utils.ingrityError: la columna contiene valores nulos
-
NameError: el nombre NP no está definido
-
Model.Lapeers [4] .set_weights ([Ingredding_matrix])
-
Restaurar TF Modelo Python ValueError: Función de pérdida desconocida: Smoothl1
-
Error de frasco: werkzeug.routing.builderror
-
ValueError: se debe especificar inicial_value. Sitio: stackoverflow.com
-
Error: 1408f10b: rutinas SSL: SSL3_GET_RECORD: número de versión incorrecto
-
Mejorar la resolución tkinter ctypes, aumentar la resolución de la ventana tkinter ctypes
-
RuntimeError: use tf.experimental.tensorrt.converter en TF 2.0. Sitio: stackoverflow.com
-
django.db.utils.programmingerror: (1146
-
hwo para descargar video usando la resolución más alta de Pytube
-
Importador: ningún módulo llamado Pip
-
python typeError: la función toma argumentos posicionales pero se les dio
-
TypeError: secuencia elemento 1: instancia STR esperada, no se encontró
-
ValueError: solo un elemento se pueden convertir en tensores a Python Scalars
-
RuntimeError: la entrada debe tener 3 dimensiones, Got 4 Site: stackoverflow.com
-
Python ValueError en strpTime ()
-
Errores críticos Python
-
ValueError: todas las cadenas deben ser compatibles con XML: unicode o ASCII, sin bytes nulos o caracteres de control
-
hacer un coo_matrix
-
Error: la ruta objetivo existe pero no es un directorio, no continuará.
-
Errores que recibirá en la clase de tiempo en Python DateTeMe
-
Importador circular: no se puede importar el nombre
-
Oserror TraceBack (la última llamada reciente)
-
IndexError: Índice de asignación de lista fuera de rango
-
TAR: Salir con el estado de la falla debido a errores anteriores
-
Errores de tiempo de ejecución en Python
-
Errores de correo electrónico de administración
-
RuntimeError: DataLoader Worker (PID (s) 13615) salió inesperadamente
-
comando errado con el estado de salida 1:
-
Se ha producido una excepción: FileNotFoundError
-
MP.Solutions.Finds no en Python 3.8
-
Python Polyfit con errores
-
scattter_matrix pandas
-
KeyError: 0 Python
-
Python KeyError
-
Myshop Flower NotimplementError
-
Error: Directorio no vacío @ dir_s_rmdir - /usr/local/cellar/python/3.7.3
-
Cambiar el tamaño de la fuente Pandas Scatter_matrix
-
ImporterRor: Sys.Meta_Path es ninguno, Python probablemente se apaga
-
Pytest RuntimeError: no se encontró ninguna aplicación. Trabaje dentro de una función de vista o presione un contexto de aplicación
-
[Resuelto] AtributeError: Numpy.nDarray Object no tiene un índice de atributo
-
ValueError: no se pudo convertir una matriz numpy a un tensor (tipo de objeto no compatible int).
-
Python SyntaxError: personaje inesperado después del carácter de continuación de la línea
-
Django bucle a través de errores de formulario
-
Python Numpy Asmatrix Función Sintaxis
-
ValueError: desconocido no es compatible en sklearn.rfecv
-
Esquemas de errores de decodificación de Python
-
grid_data = d.iloc [índice] .as_matrix () .Reshape (28,28) No funciona
-
aiohttp.client_exceptions.clientconnectorCertificateError
-
Problema TypeError: Numpy.float64 El objeto no puede interpretarse como un entero
-
TemplatesyntaxError
-
Deshabilitar errores de consola Chrome selenium
-
Ejemplo de función de asmatriz de Python Numpy
-
mala resolución con la trama de DF
-
OPENCV (3.4.11) Error: fallado de afirmación (_img.rows * _img.cols == vecsize) en cvcascadeimagreeader :: posader :: get
-
ValueError: proporcione un nombre de TPU para conectarse. Sitio: stackoverflow.com
-
elevar KeyError (clave) de ninguno de los osos.
-
IndexError: índice infantil fuera de rango en el análisis XML para la detección de objetos
-
TypeError: strpTime () argumento 1 debe ser STR, no en lista
-
Asyncio RuntimeError: el bucle de eventos está cerrado
-
Errores mientras se usa el método OS.MakedIrs ()
-
Cómo verificar si una lista aumenta IndexError pero wihing a If Declary Python
-
TypeError: __init __ (): argumentos de constructor incompatibles. Se admiten los siguientes tipos de argumentos: 1. tensorflow.python._pywrap_file_io.bufferedInputStream (arg0: str, arg1: int)
-
urllib_errors
-
ValueError: no se puede convertir Float Nan en entero
-
AttributeRor: STR Object no tiene decodificación de atributo
-
binascii .Error: relleno incorrecto en Python Django
-
AttributeRorRor: __enter__ en Python CDE
-
TypeError: no se puede desempaquetar objeto flotante no iterable evaluar
-
ValueError: Tuple.Index (x): x no en tuple
-
RuntimeError: No se puede abrir FeatureClass en Python
-
Verifique el archivo STL en busca de errores en Pyvista
-
Tkinter yt descarga con resolución
-
ValueError: especificador de formato no válido
-
mala resolución en las imágenes RDKIT exportadas
-
Explore las respuestas de código populares por idioma
Explorar otros lenguajes de código