“Error de condición previa TensorFlow Predicta” Código de respuesta
Respuestas similares a “Error de condición previa TensorFlow Predicta”
Preguntas similares a “Error de condición previa TensorFlow Predicta”
-
Verifique si se instala TensorFlow GPU
-
advertencias de tensorflow de tensor
-
ParserError: error de tokenización de datos. E Error: los campos esperados 1 en la línea 87, Saw 2
-
Error de validación de importación en Django
-
Obtenga el nombre del dispositivo GPU TensorFlow
-
Error de instalación de PIP
-
ADVERTENCIA: Hubo un error revisando la última versión de PIP.
-
Cómo imprimir error en intento excepto python
-
Importar error de registro cuadrado medio
-
TensorFlow Check GPU
-
Python obtenga un número de error de línea
-
Dotenv Error Pip Python
-
Verificación de la versión TensorFlow
-
Spacy ERROR EN_CORE_WEB_SM
-
Python excepto el error como e
-
Modelo de carga TensorFlow
-
actualizar tensorflow pip
-
Desde Sklearn.Cross_Validation Import Train_test_split Error
-
Error al cuadrado medio Python
-
Consulte GPU en TensorFlow
-
Tensorflow Mnist DataSet Import
-
CondA Tensorflow
-
Divide por error cero Python Exception Manipling
-
Error de CORS en Flask
-
Error de pandas Tokenizing Data.
-
trama de historia de tensorflow
-
prueba de GPU de tensorflow
-
modelo de trama de tensorflow
-
Error de antorcha de instalación de PIP
-
Importar error absoluto medio
-
urllib.error.urlerror:
-
Error SSL de transmisión por línea
-
TensorFlow apague GPU
-
Sklearn Error de cuadrado medio
-
Trace de error de impresión de Python
-
Pandas predicen el movimiento promedio
-
Python Error Get Line
-
Error del servidor 500 Heroku Django
-
Error del matraz
-
Manejo de errores en Python usando Flask
-
Frasco de manejo de errores
-
Flower no implementado error
-
Error emergente en django no visible
-
Error de Python Magic Windows
-
Cómo cambiar el número de pasos en la API de detección de objetos TensorFlow
-
Discord.py en error de comando
-
error de certificado de python twilio
-
Manejo de errores del conector de copo de nieve
-
Función de activación de mish TensorFlow
-
de Sklearn.PrecoSing Import StandardsCaler Error
-
Error de importación en el mismo directorio Python
-
El error de la clave extranjera de Django no puede asignar debe ser una instancia
-
El error fatal detectado no pudo ejecutar script
-
Tensorflow keras save modelo
-
MIMETYPE ERROR DJANGO REACT
-
GPU entrenamiento tensorflow
-
Solución de error de matriz de confusión
-
Plantilla de error de renderizado
-
porcentaje de error absoluto medio Python
-
Error advertencia tkinter
-
Obtenga el nombre de GPU TensorFlow y Pytorch
-
Calcule la raíz Error cuadrado medio Python
-
Model.Predict ([x_test]) Error
-
Cómo crear tensor aleatorio con tensorflow
-
LearningRate Scheduler Tensorflow
-
Tensorflow Binary Cross Entropy Entropy
-
Reemplace el error con nan pandas
-
SQLITE Error operacional No hay tal columna
-
trazado de la barra de error Python
-
Error de canal no disponible en condena
-
Error de instalación de Pyaudio Ubuntu
-
Error fatal en el lanzador: no se puede crear el proceso
-
Error Urllib Solicitar ningún atributo
-
Ignorar Error Abrir archivo Python
-
ParserError: error de tokenización de datos. E Error C: esperados 1 campos en la línea 6, Saw 3
-
Modelo de carga de carga TensorFlow
-
Error de captura Python
-
Verifique CUDA disponible TensorFlow
-
El origen remoto ya existe un error git
-
Verifique el tipo de tensor TensorFlow
-
Error de servidor interno 500 Flask de Python
-
Respuesta de error de retorno del frasco
-
Implementación de tensorflow bert
-
Skip Error Python
-
Moviewriter stderr: ffmpeg: error al cargar bibliotecas compartidas: libopenh264.so.5: No se puede abrir el archivo de objeto compartido: no hay dicho archivo o directorio
-
Cómo saber la longitud de un conjunto de datos Tensorflow
-
Error de juego
-
Error de juego Python
-
elevar un error de API en la vista de descanso de Django
-
archivos estáticos que no cargan 404 error django
-
donde esta tensorflow delgada
-
TensorFlow Load H5 Modelo
-
El comando de error errado con el estado de salida 1 face_recognition
-
Obtenga la versión de la versión TensorFlow en Ubuntu
-
Ver versión de TensorFlow Python
-
No puedo instalar Tensorflow Pip Python 3.6
-
multiplicación de matriz tensorflow
-
Instale la GPU de TensorFlow
-
Python Archivo Abrir intento excepto error
-
modelo de carga keras tensorflow
-
Variables de lista en la sesión TensorFlow 1
-
establecer el flujo de tensor de semillas
-
Catch Data de error con excepto Python
-
urllib.error.urlerror:
-
Tensorflow Adam
-
Python Tensorflow no está definido
-
Error de PIP install Pywhatkit
-
Manejo de errores de Python
-
Seaborn Barplot elimina las barras de error
-
Tensorflow a Numpy
-
Cómo convertir Tensor para enumerar TensorFlow
-
Salida de error de impresión de Python
-
Instalación de TensorFlow con conda
-
Cómo instalar TensorFlow en la CPU de Windows
-
Mensaje de error de Windows Python
-
Cómo ocultar advertencias de flujo de tensor
-
Agregue TensorFlow a Conda
-
Aumentar el umbral usando predicto proba
-
sklearn prediciendo umbral
-
Error de Mod_wsgi de PIP install
-
precisión de las métricas de tensorflow
-
Error de chatbot de Python
-
red neuronal de tensorflow
-
tensorflow reduce_sum
-
Error de tipo de impresión Python
-
intente excepto el error de decodificación JSON
-
Mientras activaba envé, muestra un error de acceso a no ya -utorize en VScode
-
Error de captura en Mongo Query Python
-
Python verifica si la entrada () da error
-
TensorFlow Inst para Python 3.6
-
Cómo omitir el error Python
-
Manejo de errores de frasco
-
Métricas de evaluación de tensorflow
-
Frasco de la página de error de edición
-
Deshabilitar GPU en Jupyter Notebook en TensorFlow
-
Cómo personalizar el mensaje de respuesta de error SimpleJWT en Django Restframework
-
importar pycocotools._mask como _Mask Error esperado 80, obtuvo 88
-
Tabla de error de Django ya existe
-
Cómo matar un script si el error es presionado python
-
Error de personaje de Python Unicode
-
Existe el archivo de verificación TensorFlow IO IO
-
Desde imblearn.over_sampling Error de smote de importación
-
Error de sesgo medio
-
navegador = webdriver.firefox () Error
-
Función de ajuste TensorFlow
-
¿Cómo puedo obtener la salida de cada capa en TensorFlow 2?
-
tensorflow use memoria en crecimiento
-
Instale el error de PocketSphinx
-
tensorflow conv2d
-
SystemError: retorno de error sin excepción establecida
-
advertencias de Python como error
-
Generador de datos de imagen TensorFlow
-
hwo a excepto todos los errores en Python Pry Statemen
-
tensorflow crea inicializador personalizado
-
Cómo convertir el modelo TensorFlow 1.15 en TFLITE
-
Error de 400 Error Python
-
Error de conversión de Python Catch int
-
Use el modelo desde el punto de control tensorflow
-
flujo tensor
-
Tensorflow Dense de activación de la capa Leaklyrelu
-
convertir la función numpy en tensorflow
-
Error de Python
-
Error de importación circular
-
Error Python
-
Aumento de datos TensorFlow
-
Error de sintaxis de Python Jedi
-
RuntimeError: Error en el cálculo de la triangulación de Qhull Delaunay: datos de entrada singular (ExitCode = 2); Use la opción Python Levet (-V) para ver el error Qhull original.
-
Pandas MySQL Error en consulta concats con el espacio
-
Error de sangría en el editor de Python Atom
-
Error fuera de uno en Python
-
Error de la bifurcación de Python
-
Error en el comando de configuración de matplotlib: use_2to3 no es válido
-
Error de objeto httpponse en View.py
-
Colab no entrenando siempre dando a CUDA Error fuera de memoria.
-
Error absoluto medio en la fórmula de aprendizaje automático
-
FCN Tensorflow
-
Manejo de errores de valor
-
Error cero
-
La aplicación Django WSGI no se pudo cargar error de importación del módulo
-
Error de sangría Python
-
error adicional
-
Obtener el nombre del dispositivo TensorFlow
-
Error de Python DT solo se usa con valores de DataTimElike
-
TensorFlow configure múltiples GPU
-
Error al cuadrado medio en la fórmula de aprendizaje automático
-
tensorflow tf.constant
-
El PD no está definido por error de Python
-
Bar Plot Seborn sin barras de error
-
Django Brutebuster Error falló intentos
-
ConfigParser Error al leer la ruta del archivo relativo
-
Django dos kilómetros extranjeros al mismo error de administrador del modelo
-
Error 302 Heroku Django
-
Manejo de errores de Django
-
Error de dominio de matemáticas Python
-
Excepción de error de valor
-
Error cuadrado medio de raíz en la fórmula de aprendizaje automático
-
Error de excepción de Python vs
-
Error de OpenCV [Warn: 0] Terminar la devolución de llamada de Async
-
distancia euclidiana de tensorflow
-
ERROR DEL PERMEDIO_HOSTS ECS DJANGO
-
Django Error que muestra la página de imágenes no encontrada
-
tensorflow bucle csdn
-
Error de verificación de archivo de archivo de Python
-
Scikit aprender Predicta perezosa
-
Slack Bot Error no_in_channel
-
cómo predecir la salida de nuevos datos con el modelo probado ya
-
Error de cromedriver no detectado de selenio
-
tensorflow conv2d operación
-
Error vacío de Python Multiprocessing Queu
-
Error de flotación Python
-
corrige el error cuando cierra la pantalla de tortuga en tu propio bucle principal
-
elevar httperror (req.full_url, código, msg, hdrs, fp) urllib.error.httperror: http error 429: demasiadas solicitudes
-
Roberta inferencia tensorflow
-
Uso de la biblioteca de rastreo de anillo para pasar un error
-
Python Escribir al flujo de errores
-
Python NLTK Error de búsqueda Recurso OMW-1.4 no encontrado.
-
Predecir las probabilidades con XG Boost
-
Pantalla de tortuga Cerrar corrección de error
-
Error de dictes múltiples
-
Tensorflow 1.x implementación de spp
-
Error de Python Synta
-
Error de región cuando se usa la cuenta de servicio JSON File DatapROC
-
Esta línea es obligatoria para agregar en cualquier momento que desee usar la biblioteca PyGame. Debe agregarse antes de cualquier otra función de pygame, de lo contrario, puede ocurrir un error de inicialización.
-
Keras Modelo Predicte Lista de tensores de entrada
-
Error de selenio 403 Python
-
Visual Studio Code Pylint: Error cuando todo está bien
-
Django REST Framework Relación de clave externa Error en serializador
-
Python Derivative del error cuadrático medio
-
Error de DataProc Initialization_actions
-
Captura de scrape: descarga de errores
-
Python Error Captura de módulos
-
Cadena de Python: error de índice
-
La columna de error de Django last_login no puede ser nula
-
Error de análisis ASN1 al intentar conectarse a Mongo Atlas
-
Error HTTP 403: Correo electrónico de registro de la cuenta de Django Prohibido
-
Restablecer todos los pesos Tensorflow
-
Python Numpy ASArray_ChkFinite Función Ejemplo aumenta el error de valor
-
Cómo crear modelo en TensorFlow
-
Ganancia de la máquina para predecir Sentimentanalysis Python
-
Oauthlib Python Error
-
escribo nano en python y obtengo error
-
Marco de descanso de error de atributo
-
error de permiso
-
Convertir Darkflow yolov3 tensorflow lite
-
Si el error de la función grepper
-
Agregar mensaje de error en django loginrequiredmixin
-
Cálculo de error R-cuadrado y MNSE
-
Error HTTP 403: Django prohibido usando sendGrid
-
Albumentación de tensorflow detección de objetos
-
¿Qué significa cuando recibo un error de permiso en Python?
-
Error estándar de la media
-
Python Pyaudio Error
-
Error unicode Python
-
Error de valor de Python
-
¿Necesito hacer algún conjunto cuando uso GPU para entrenar el modelo TensorFlow?
-
Python Escribir error al archivo
-
Numpy vs Tensorflow
-
Django Forms Error personalizar
-
La estética de error debe ser de longitud 1 o lo mismo que los datos (3) rellenar
-
Use regresión lineal para predecir Python
-
Corrección de errores del código
-
Error de Unocodo Pytonn
-
Dashboard del clima espacial Construya su propio tablero personalizado para analizar y predecir el clima
-
Más respuestas relacionadas con “Error de condición previa TensorFlow Predicta” en Python
-
Python RuntimeError: tf.placeholder () no es compatible con la ejecución ansiosa.
-
XLRDERROR: archivo Excel XLSX; No soportado
-
pytube.exceptions.regexMatchError: get_throttling_function_name: no pudo encontrar coincidencia para múltiples
-
ValueError: TZ-AWARE DateTime.Datetime no se puede convertir a Datetime64 a menos que UTC = verdadero sitio: stackoverflow.com
-
Línea de comandos ambientaletror
-
PACKAGSNOTFoundError: los siguientes paquetes no están disponibles en los canales actuales: - Python == 3.6
-
ls.ProgrammingError: permiso denegado para la tabla django_migrations
-
Importor: ningún módulo llamado Builtins
-
AttributeRorRor: esta instancia de consulta es django inmutable
-
ImporterRor: el módulo dinámico no define la función de exportación de módulos (pyinit_cv_bridge_boost)
-
ImporterRor: No se puede importar el nombre de JSON de ItsDangero
-
SyntaxError: código no UTF-8 que comienza con
-
No se encontró una distribución coincidente para TensorFlow == 2.2.0
-
Importor: ningún módulo llamado django.core.wsgi
-
ValueError esperado La matriz 2D obtuvo una matriz 1D en lugar de una regresión lineal de Python
-
RuntimeError: intentar deserializar el objeto en un dispositivo CUDA pero atorch.cuda.is_available ()
-
FIJO IMPORTERROR: Ningún módulo llamado PIL
-
keyError dismido_count Pafy
-
Lookuperror: Codificación desconocida: Idna Python
-
RecursionerRor Máxima profundidad de recursión
-
Importor: ningún módulo llamado user_agent
-
Importador: no podría
-
AssertionError: el campo relacional debe proporcionar un argumento `QuerySet`, anular` get_queryset` o establecer read_only = `true
-
para E en p.event.get (): pygame.error: sistema de video no inicializado
-
ValueError: no se pudo convertir una matriz numpy a un tensor (flotador de tipo de objeto no compatible).
-
manejar errores en el frasco
-
Autorror de frascos
-
_CSV.Error: campo mayor que el límite de campo (131072)
-
Error de python2 iónico: no encontrado: python2
-
flor de apio NotimplementError
-
cv_bridge.core.cvbridgeError: [8uc4] no es un formato de color. Pero [BGR8] es. La conversión no tiene sentido
-
Python especificar la salida de typeError
-
Python/Docker ImporterRor: No se puede importar el nombre JSON de ItsDangero
-
dividir por cero errores al usar anotar
-
Entrada de nombre de Python
-
ValueError: Numpy.ndArray Tamaño cambiado, puede indicar incompatibilidad binaria. esperado 88 del encabezado C, obtuvo 80 de Pyobject
-
ValueError: puede haber como máximo 1 encabezados sujetos en un mensaje
-
Oserror: no se puede escribir en modo RGBA como JPEG Python
-
Importor: ningún módulo llamado _bootlocale
-
FutureWarning: Imagen de entrada dtype es bool. La interpolación no se define con el tipo de datos de bool. Establezca el pedido en 0 o explícitamente la imagen de entrada a otro tipo de datos. A partir de la versión 0.19 se planteará un ValueError en lugar de esta advertencia.
-
smtpauthenticationError
-
ValueError: los logits y las etiquetas deben tener la misma forma ((ninguna, 1) vs (ninguno, 2))
-
[Resuelto] typeError: no se puede multiplicar la secuencia por no intento de type str
-
WinError 5 Access se niega PIP
-
TypeError: Sitio de objeto de cadena esperada o bytes: stackoverflow.com
-
ImporterRor: libgl.so.1: No se puede abrir el archivo de objeto compartido: no hay dicho archivo o directorio
-
Emisión de pandas typeError: no hay datos numéricos para trazar
-
django.db.utils.operationalError: no hay tal tabla:
-
ImporterRor: no se puede importar el nombre ABC
-
Error: la rueda de construcción fallida para almohada
-
SSL.SSLCertVerificationError: [SSL: certificate_verify_failed] Verificar el certificado Falta: No se puede obtener el certificado del emisor local (_ssl.c: 1091)
-
Importor: ningún módulo llamado EasyDict
-
TypeError: las excepciones deben derivar de BaseException
-
SystemError: el mosaico no puede extenderse la imagen externa
-
UnboundLocalError: variable local
-
Importor: ningún módulo llamado _tkinter, instale el paquete python-tk
-
Error del sistema operativo: conexión rechazada, errno = 111, dirección = 127.0.0.1, puerto = 43350
-
Error de CUDA: afirmación del lado del dispositivo activado
-
ValueError: `logits` y` etiquetas` deben tener la misma forma, recibida ((ninguno, 2) vs (ninguno, 1)).
-
TypeError: los objetos unicode se deben codificar antes del hash
-
TypeError: no puede desempaquetar el objeto int no iterable
-
Python ignora unicodedecodeerror
-
Importador: el módulo dinámico no define la función de exportación de módulos
-
ImporterRor: no hay solicitudes de módulo con nombre
-
Importador: ningún módulo llamado Flask
-
RuntimeError: Broken Toolchain: no se puede vincular un programa C simple C
-
ValueError: con n_samples = 0, test_size = 0.2 y Train_size = None, el conjunto de tren resultante estará vacío. Ajuste cualquiera de los parámetros antes mencionados.
-
NameError: el nombre PD no está definido
-
tensorflow_version
-
Importador: ningún módulo llamado Colored
-
DataFrame KeyError:
-
Problema typeError: no puede multiplicar la secuencia por no intento de tipo STR
-
TypeError: secuencia elemento 0: instancia str esperada, int encontrado
-
Importador: la carga DLL falló al importar Win32File: no se pudo encontrar el módulo especificado.
-
Importador: la carga DLL falló al importar Win32API: no se pudo encontrar el procedimiento especificado.
-
ValueError: formas (ninguna, 1) y (ninguno, 11) son keras incompatibles
-
TypeError: forma inválida (3, 32, 32) para datos de imagen
-
ValueError: columnas se superpone pero no hay sufijo especificado:
-
TypeError: el objeto float no se puede llamar
-
Taberror: uso inconsistente de pestañas y espacios en la muescas
-
IndexError: índice no válido de la variable escalar.
-
ValueError: matriz encontrada con DIM 3. Estimador esperado
-
Problema AtributeError: Numpy.ndArray Object no tiene un índice de atributo
-
Error: Wheel de construcción fallida para Python-LDAP
-
TypeError: strptime () argumento 1 debe ser str, no series
-
intente excepto keyError
-
UnicodeDecodeError UTF8 Codec Cant Decode Byte Byte Pandas
-
SognationError: sangría inesperada
-
UnicodeDecodeError: UTF8 Codec Cant Decode Byte
-
Ignorar errores o advertencias de pytest
-
Cómo registrar errores mientras la depuración es falsa en django
-
archivo unicodeDecodeError leído
-
python criar typeError
-
Cómo arreglar ValueError en Python
-
AT = Código de error = H10 DESC = APP Crasado Python Flask
-
xml.parsers.EXPAT.EXTERROR: no bien formado (token inválido): línea 1, columna 0
-
tensorflow.keras.utils.to_categorical
-
SyntaxError: el argumento posicional sigue el argumento de palabras clave
-
sqlite3.programmingError: número incorrecto de enlaces suministrados. La declaración actual usa 1, y hay 7 suministrados.
-
FileExistsError: [ERRNO 17] El archivo existe:
-
No se encuentra la aplicación de Python, verifique sus registros de inicio en busca de errores
-
Error: el comando erróneo con el estado de salida 1
-
Error: getAddrinfo enotfound www.python.org www.python.org:443 Descargar Python falló. Error: {Error: getAddrinfo enotfound www.python.org www.python.org:443
-
ImporterRor: no se puede importar el nombre incluir
-
Error: no bien formado (token no válido)
-
Por qué Pytest no devuelve el módulo
-
Eoferror: eof al leer una línea
-
Desde django.core.management import execute_from_command_line ImporterRor: ningún módulo llamado django.core.management
-
IntegrityError Import en Django
-
IntegrityError
-
OSError: [ERRNO 98] Dirección ya en uso
-
Oserror: enlace de servicio cruzado no válido
-
ValueError: la dimensión de datos de consulta debe hacer coincidir la dimensión de datos de entrenamiento
-
ValueError: no se puede remodelar la matriz del tamaño 98292 en forma (16382,1,28) Sitio: stackoverflow.com
-
ValidationError Django Params
-
Obtuve AttributeRorror al intentar obtener un valor para el campo Nombre` en Serializer
-
ValueError: Literal no válido para int () con base 10: Sitio: stackoverflow.com
-
Python ValueError: matriz de tamaño cero a operación de reducción máxima que no tiene identidad
-
BasesshtunnelforwarderError: no pudo establecer sesión en SSH Gateway
-
modelo. -predicto knn
-
¿Qué son los errores de postcondición en Python?
-
Python Habilitar errores de Pyqt
-
Python Wifi Moudel [WinError 2] El sistema no puede encontrar el archivo especificado
-
de sklearn.metrics import confusion_matrix pred = model.predict (x_test) pred = np.argmax (pred, axis = 1) y_true = np.argmax (y_test, axis = 1)
-
Sqlalchemy IntegrityError
-
RuntimeError: configure el modo de numeración de pin usando gpio.setmode (gpio.board) o gpio.setMode (gpio.bcm)
-
Python eleva FileNotfoundError
-
error de tecleado:
-
TypeError: el objeto de tipo dictproxy no es serializable
-
excepto filenotfoundError
-
django.db.utils.integrityError:
-
Python Global Variable UnboundLocalError
-
TypeError: DICT no es una secuencia
-
Error de instalación de la tubería de medios: no pudo encontrar una versión que satisfaga el requisito MediaPipe (de versiones: ninguno)
-
PermissionError: [Errno 13] Permiso denegado en Flask
-
dlib.shape_predictor
-
ModulenotfoundError: no se nombra módulo
-
Importor: ningún módulo llamado Pandas
-
TypeError: está prohibida la asignación directa al lado directo de un conjunto de muchos a muchos. Use .set () en su lugar
-
MultivaluDictKeyError django
-
django-multivalueDictKeyError-error
-
typeError: objeto esperado Str, bytes u Os.
-
Errores de registro en correos electrónicos
-
plt.imshow typeError dimensiones no válidas para datos de imagen
-
Cómo atrapar el cudastero
-
Manejo de errores mientras usa el método OS.MakedIrs ()
-
AttributeRorRor: módulo
-
Cómo enviar una imagen que se envió con una solicitud de publicación a un modelo de predicción
-
ValueError: matriz dispersa esperada con valores enteros, valores de flotación encontrados
-
Fundación de resultados de Model.Predict () Predicción con Pandas DataFrame original de Pandas
-
de sklearn.metrics importan mean_square_error
-
Error de pitón fatal: no se puede recuperar del desbordamiento de la pila.
-
El comando planteó una excepción: typeError: discord.py
-
sqlite3.operationalerRor no hay tal versión de columna
-
RuntimeError: Objeto esperado de tipo Torch.floattensor pero se encuentra tytorch.cuda.floattensor para el argumento
-
Errores de sintaxis de Python
-
[Resuelto] pandas typeError: no hay datos numéricos para trazar
-
ValueError: Y_true y Y_Pred contienen diferentes números de clases 6, 2. Proporcione las etiquetas verdaderas explícitamente a través del argumento de etiquetas. Clases encontradas en y_true: [0 1 2 3 4 5]
-
** (argumenterRor) Las listas en Phoenix.html y las plantillas solo pueden contener enteros que representan bytes, binarios u otras listas, obtuvieron entrada no válida:
-
El valor no es un dict (type_error.dict) válido (type_error.dict) Respuesta_Model Fastapi
-
django.db.utils.ingrityError: no la restricción nula falló
-
Cómo obtener nombres de clase en Predict_Proba
-
Cómo resolver los errores de importación mientras intenta implementar el frasco usando WSGI en Apache2
-
modelo. predicto python
-
Errores que obtendrá durante el objeto de fecha en Python DateTeMe
-
django.db.utils.ingrityError: la columna contiene valores nulos
-
NameError: el nombre NP no está definido
-
modelo. predicto modelo de árbol de decisión
-
Restaurar TF Modelo Python ValueError: Función de pérdida desconocida: Smoothl1
-
Error de frasco: werkzeug.routing.builderror
-
La predicción del modelo XGB cambia si guardo y carga el modelo
-
ValueError: se debe especificar inicial_value. Sitio: stackoverflow.com
-
Error: 1408f10b: rutinas SSL: SSL3_GET_RECORD: número de versión incorrecto
-
RuntimeError: use tf.experimental.tensorrt.converter en TF 2.0. Sitio: stackoverflow.com
-
django.db.utils.programmingerror: (1146
-
Importador: ningún módulo llamado Pip
-
python typeError: la función toma argumentos posicionales pero se les dio
-
TypeError: secuencia elemento 1: instancia STR esperada, no se encontró
-
ValueError: solo un elemento se pueden convertir en tensores a Python Scalars
-
RuntimeError: la entrada debe tener 3 dimensiones, Got 4 Site: stackoverflow.com
-
Python ValueError en strpTime ()
-
Errores críticos Python
-
ValueError: todas las cadenas deben ser compatibles con XML: unicode o ASCII, sin bytes nulos o caracteres de control
-
Un problema de predecir si un estudiante tiene éxito o no de su GPA y GRE. Para la regresión logística
-
Error: la ruta objetivo existe pero no es un directorio, no continuará.
-
trama de dispersión real vs predicho pitón
-
Errores que recibirá en la clase de tiempo en Python DateTeMe
-
Importador circular: no se puede importar el nombre
-
Oserror TraceBack (la última llamada reciente)
-
IndexError: Índice de asignación de lista fuera de rango
-
TAR: Salir con el estado de la falla debido a errores anteriores
-
Errores de tiempo de ejecución en Python
-
Errores de correo electrónico de administración
-
RuntimeError: DataLoader Worker (PID (s) 13615) salió inesperadamente
-
comando errado con el estado de salida 1:
-
Se ha producido una excepción: FileNotFoundError
-
Python Polyfit con errores
-
KeyError: 0 Python
-
Python KeyError
-
Myshop Flower NotimplementError
-
Error: Directorio no vacío @ dir_s_rmdir - /usr/local/cellar/python/3.7.3
-
ImporterRor: Sys.Meta_Path es ninguno, Python probablemente se apaga
-
Pytest RuntimeError: no se encontró ninguna aplicación. Trabaje dentro de una función de vista o presione un contexto de aplicación
-
[Resuelto] AtributeError: Numpy.nDarray Object no tiene un índice de atributo
-
ValueError: no se pudo convertir una matriz numpy a un tensor (tipo de objeto no compatible int).
-
Python SyntaxError: personaje inesperado después del carácter de continuación de la línea
-
Django bucle a través de errores de formulario
-
ValueError: desconocido no es compatible en sklearn.rfecv
-
Esquemas de errores de decodificación de Python
-
Obtener y_hat o valores predichos de y basados en x_values
-
aiohttp.client_exceptions.clientconnectorCertificateError
-
Problema TypeError: Numpy.float64 El objeto no puede interpretarse como un entero
-
TemplatesyntaxError
-
Deshabilitar errores de consola Chrome selenium
-
ADVERTENCIA: TensorFlow: Max_Values está en desuso, use max_tokens en su lugar. ADVERTENCIA: TensorFlow: VOCAB_SIZE está en desuso, use VOCABULARY_SIZE. ADVERTENCIA: TensorFlow: Max_Tokens está en desuso, use num_tokens en su lugar.
-
OPENCV (3.4.11) Error: fallado de afirmación (_img.rows * _img.cols == vecsize) en cvcascadeimagreeader :: posader :: get
-
ValueError: proporcione un nombre de TPU para conectarse. Sitio: stackoverflow.com
-
elevar KeyError (clave) de ninguno de los osos.
-
IndexError: índice infantil fuera de rango en el análisis XML para la detección de objetos
-
TypeError: strpTime () argumento 1 debe ser STR, no en lista
-
Asyncio RuntimeError: el bucle de eventos está cerrado
-
Errores mientras se usa el método OS.MakedIrs ()
-
Cómo verificar si una lista aumenta IndexError pero wihing a If Declary Python
-
TypeError: __init __ (): argumentos de constructor incompatibles. Se admiten los siguientes tipos de argumentos: 1. tensorflow.python._pywrap_file_io.bufferedInputStream (arg0: str, arg1: int)
-
urllib_errors
-
ValueError: no se puede convertir Float Nan en entero
-
AttributeRor: STR Object no tiene decodificación de atributo
-
binascii .Error: relleno incorrecto en Python Django
-
AttributeRorRor: __enter__ en Python CDE
-
TypeError: no se puede desempaquetar objeto flotante no iterable evaluar
-
ValueError: Tuple.Index (x): x no en tuple
-
RuntimeError: No se puede abrir FeatureClass en Python
-
Verifique el archivo STL en busca de errores en Pyvista
-
ValueError: especificador de formato no válido
-
Explore las respuestas de código populares por idioma
Explorar otros lenguajes de código