“Instale el error de PocketSphinx” Código de respuesta
Respuestas similares a “Instale el error de PocketSphinx”
Preguntas similares a “Instale el error de PocketSphinx”
-
Instalar Matplotlib Conda
-
instalar beautifulsoup en Anaconda
-
ParserError: error de tokenización de datos. E Error: los campos esperados 1 en la línea 87, Saw 2
-
Instalación de Sqlalchemy Python
-
Instalar OpenCV Python
-
¿Cómo instalar OpenCV?
-
instalación de matplotlib
-
instalar matplotlib
-
Cómo instalar matplotlib en python
-
Python Pip Instalar matplotlib
-
Python Instalar matplotlib
-
Instalar teletón
-
conda install ffmpeg
-
Error de validación de importación en Django
-
conda install lxml
-
PIP install MySQLDB
-
instalar xgboost
-
Cómo instalar Pyaudio en Python
-
Cómo instalar Pyaudio
-
Solicitudes de instalación de Anaconda
-
Cómo instalar Numpy
-
python instalar pip
-
Descargar PIP Install
-
sudo python3 -m pip install pyautogui
-
ADVERTENCIA: Hubo un error revisando la última versión de PIP.
-
Cómo instalar Pip en Anaconda
-
Cómo imprimir error en intento excepto python
-
Instalar Python en serie
-
instalar Django Rest Framework
-
CondA Instalar tablero
-
instalar Docx Python
-
conda install xgboost
-
Instalar Imageio
-
Instalar paquetes de python-dev.
-
Cómo instalar Dask en Python
-
Importar error de registro cuadrado medio
-
Instalación de Python BS4
-
instalar fastapi conda
-
Python Instalar pandas para Linux
-
Instale pandas en Python en Ubuntu
-
Instalar rugklit
-
Python install FFPyPlayer
-
Instale Pipenv en Windows
-
python install pylab
-
instalación de python pyodbc
-
conda install spacy
-
Python obtenga un número de error de línea
-
Mac install Python 3.8
-
Dotenv Error Pip Python
-
instalar re paquete python
-
python3 instalar google
-
Cómo instalar MediaPipe Python
-
Cómo instalar MediaPipe en Pycharm
-
Spacy ERROR EN_CORE_WEB_SM
-
Cómo instalo el cuaderno Jupyter en un nuevo entorno virtual de conda
-
Linux Ubuntu install Python 3.7
-
Jupyter instalar entorno de usuario
-
instalación de ipykernel
-
Instale Python en Ubuntu
-
Ubuntu install Python 3.8
-
Instale matplotlib.pyplot Mac Python 3
-
Instalar spotipy
-
Cómo instalar Spotipy Python
-
Instalar solicitudes Python
-
Cómo instalar controladores para Selenium Python
-
Instalar ReportLab Python
-
Python excepto el error como e
-
Instale Python en el subsistema de Windows para Linux
-
Cómo instalar pandas dataArader en conda
-
Desde Sklearn.Cross_Validation Import Train_test_split Error
-
Instale Python 3.9 Ubuntu
-
Comando de instalación de Python en Linux
-
Error al cuadrado medio Python
-
Cómo instalar Pygame en Python 3.8
-
instalar easygui
-
Instale una versión específica de Django
-
instalación de pyyaml
-
PIP3 instalar pyaml
-
Cómo instalar gimnasio
-
instalación de Pycord
-
Cómo instalar Python3 en Ubuntu
-
Cómo instalar Python3 en Ubuntu
-
Cómo instalar el módulo Flask en VScode
-
instalar maldiciones python
-
Instale Python 3.9 Linux
-
Instale Python3 Centos 7.8
-
Instale Python3.7 Ubuntu 20.04
-
Divide por error cero Python Exception Manipling
-
Error de CORS en Flask
-
Error de pandas Tokenizing Data.
-
Instale Python 3.8 Linux
-
instalación de frascos
-
instalar Flake8 Python
-
Módulo de instalación de Python desde el script
-
Instale paquetes de Python en Python Shell
-
Paquete de instalación de Python desde el código
-
Python Pip Instalar desde el script
-
Importar error absoluto medio
-
Cómo instalar Tkinter
-
sudo apt-get install python3-tk no funciona
-
instalar wxpython
-
Cómo instalar PIP en Mac
-
Cómo varificar Pip es instalar en Python
-
PIP Instale Speedtest
-
Cómo instalar la biblioteca en Python
-
Instale el módulo Python Glob en Windows
-
Chromebook Instalar pip
-
PIP Instale Arcpy Python 3
-
conda install nltk
-
Cómo instalar NLTK
-
Mac instalar pip
-
urllib.error.urlerror:
-
Error SSL de transmisión por línea
-
Instalar modelos python
-
Instale Python 3.6 Ubuntu 16.04
-
Instale pandas en Python Mac
-
Instalación de Python Tabule
-
Instale Postgres para Python Mac
-
Python Instalar paquetes requeridos
-
PIP install FFMPEG
-
Sklearn Error de cuadrado medio
-
instalar mysql.connector
-
Cómo instalar panda3d
-
Trace de error de impresión de Python
-
sudo apto install python3-pip
-
Cómo instalar Python Pip en Ubuntu
-
Cómo instalar Flask
-
Cómo instalar CUDA en Anaconda
-
PIP Instale Apache Beam GCP
-
Cómo instalar wxpython
-
Python Error Get Line
-
Error del servidor 500 Heroku Django
-
Instalar GTTS
-
Error del matraz
-
Manejo de errores en Python usando Flask
-
Frasco de manejo de errores
-
Cómo instalar Tkinter para Python
-
$ sudo pip install pdml2flow-frame-intervalor-tiempo
-
Flower no implementado error
-
Instalar Selenium Python Mac Anaconda
-
Error emergente en django no visible
-
Error de Python Magic Windows
-
instalar Decouple Python
-
instalación de pyautogui
-
instalar Mamba Conda
-
Discord.py en error de comando
-
Erreur instalar pyaudio
-
error de certificado de python twilio
-
Manejo de errores del conector de copo de nieve
-
instalación de python cffi
-
de Sklearn.PrecoSing Import StandardsCaler Error
-
yum install python3
-
Instale Chromedriver Ubuntu Python
-
Instale Python Homebrew
-
Ubuntu Instalar Pip para Python 3.8
-
Error de importación en el mismo directorio Python
-
Frasco de instalación mínima
-
El error de la clave extranjera de Django no puede asignar debe ser una instancia
-
instalar scratchattach
-
Instale Magic Python 2
-
instalar AWS SDK Ubuntu 20.04 Línea de comandos
-
instalación de Linux Python
-
Instalar Discord Python
-
El error fatal detectado no pudo ejecutar script
-
MIMETYPE ERROR DJANGO REACT
-
Python Instalar GIMP
-
PIP Instale resultados de apio Django
-
Tensorflow no instalando error
-
Solución de error de matriz de confusión
-
Python -M PIP Install -Upgrade
-
Plantilla de error de renderizado
-
porcentaje de error absoluto medio Python
-
django.db.backends.mysql install
-
Error advertencia tkinter
-
NP Instalar Python
-
Flask Migrate Instalar
-
Calcule la raíz Error cuadrado medio Python
-
Python Install PIL
-
instalación de pil python
-
Model.Predict ([x_test]) Error
-
Instale Python 3 en Mac
-
instalar Python Mac
-
cola de instalación de pip
-
Instale Python3 6 Ubuntu 20
-
Cómo instalar Python 3.6 Ubuntu
-
Cómo instalar Django en entorno virtual en Ubuntu
-
Reemplace el error con nan pandas
-
PIP Instale la versión específica
-
Instalar OS Python
-
Cómo instalar las bibliotecas de Python
-
Instale PIP en Windows 10 Python 3.9
-
SQLITE Error operacional No hay tal columna
-
instalar python decouple
-
instalación de Ta-Lib Python
-
trazado de la barra de error Python
-
Instalación de Sklearn Python
-
Error de canal no disponible en condena
-
Instale Python 3.9 Centos8
-
instalar AWS SDK Python
-
Cómo instalar terminal en átomo
-
PIP Instale Flask Mail
-
Error fatal en el lanzador: no se puede crear el proceso
-
instalar django REST_FRamework
-
Autopía en la instalación de Python
-
Error Urllib Solicitar ningún atributo
-
Cómo instalar el módulo de subproceso en Python
-
Instalación de Python Pip
-
Cómo instalar desde URL en Python
-
Cómo instalar Pygame en Python
-
instalar pygame
-
instalación de pygame
-
Instale Pygaame con PIP
-
pygame instalar pip
-
Instale las solicitudes de las solicitudes-HTML en Python
-
Instale las características sklearn
-
Instalar Django Windows
-
Ignorar Error Abrir archivo Python
-
Instale NLTK en Python
-
PIP Instalar chatterbot
-
ParserError: error de tokenización de datos. E Error C: esperados 1 campos en la línea 6, Saw 3
-
Instalación de Python BZ2
-
instalar matplotlib pip
-
Cómo instalar OpenCV
-
Cómo instalar Python 2
-
Instale el paquete Python de Git Colab
-
marco de descanso de PIP install Django
-
instalar corsheaders
-
Instalar requisito.txt
-
Error de captura Python
-
Instale paquetes de Python desde adentro dentro del programa Python
-
Instalar desde Github
-
Instalar log21 python
-
Python Instalar OpenCV
-
Instale PIP con Pacman Linux
-
Importor: ningún módulo llamado _tkinter, instale el paquete python-tk
-
instalar python tap
-
PIP Instale Wikipedia
-
instalar Selenium Python
-
Instale paquetes de Python detrás de Proxy
-
python pip install jinja
-
Instale LZ4 Python 3
-
instalar entorno virtual python mac
-
El origen remoto ya existe un error git
-
PIP install Dal
-
Natsort Python Pip instalación
-
Python Cómo instalar Numpy en Pycharm
-
Pipenv Install -Python 3.8 Jupyter no se reconoce como un commmand interno
-
Error de servidor interno 500 Flask de Python
-
Respuesta de error de retorno del frasco
-
Instalar OpenPyxl
-
Instalar Mailer rápido
-
instalar el diseñador QT Python Ubuntu
-
Instale Python 3.6 en Centos
-
Instale Python en CentOS7
-
Instalación de python de gráfico-studio
-
instalar Qt Python
-
Instale GoogleSearch para Python
-
instalar django usando PIP
-
Instalar PIP para Python 2 y Python3
-
Skip Error Python
-
PIP Instale Strewlit
-
Cómo instalar el archivo WHL en Python
-
Instale Tkinter Python 3 Mac
-
Moviewriter stderr: ffmpeg: error al cargar bibliotecas compartidas: libopenh264.so.5: No se puede abrir el archivo de objeto compartido: no hay dicho archivo o directorio
-
PIP Instale Parser
-
¿Cómo puedo instalar el paquete XGBOost en Python en Windows?
-
Cómo instalar el paquete XGBOost en Python en Windows
-
Cómo instalar el paquete XGBOost en Python
-
Cómo instalar el paquete XGBOost en Python usando conda
-
PIP Instalar de forma segura en Jupyter
-
Instalar PIP desde Jupyter Notebook
-
Instalar frasco
-
Instalar WordCloud
-
Cómo instalar módulos a una versión específica de Python
-
instalar python setuppools ubuntu
-
Instale Flask en Linux Mint para Python3
-
Error de juego
-
Error de juego Python
-
PIP Instale Python-Telegram-Bot
-
PIP install QRCode Python
-
PIP instale Google Cloud Secret Manager
-
elevar un error de API en la vista de descanso de Django
-
Instale Python con Git Bash
-
archivos estáticos que no cargan 404 error django
-
El comando de error errado con el estado de salida 1 face_recognition
-
Cómo instalar hermosa sopa
-
PIP Instale VLC
-
Instale Python 3.6 Dockerfile
-
No puedo instalar Tensorflow Pip Python 3.6
-
Instale un mapa base en Python
-
Instalar Hydra Python
-
Python Instalar Minio
-
Instale OpenCV para Python 2.7
-
Cómo instalar un paquete en Virtualenv Python
-
Instale PIP3 para Python 3.7
-
Instalar el frasco de Socketio
-
instalar virtual entorno python
-
instalación de MSS Python
-
Cómo instalar ordenado
-
Cómo instalar bibliotecas de Python usando PIP
-
Instale el Cairo Python
-
Instale la GPU de TensorFlow
-
Instale Python Selenium WebDriver
-
Cómo instalar paquetes dentro del script thePython
-
Python Archivo Abrir intento excepto error
-
instalación de django
-
Instalar JSON en Python
-
Catch Data de error con excepto Python
-
PIP install django
-
Instale Python 3.8 en WSL
-
urllib.error.urlerror:
-
PIP install Covid
-
Instale Biopython en Windows
-
Instale Anaconda Python 2.7 y 3.6
-
Manejo de errores de Python
-
Seaborn Barplot elimina las barras de error
-
Instalar Play Sound Python Terminal
-
Instale el archivo Whele Python
-
módulo python instalar un whl
-
Rueda de instalación de Bash
-
Instalar el archivo de la rueda python
-
instalar la versión anterior de Python
-
Instale Python en Dockerfile
-
Salida de error de impresión de Python
-
Cómo instalar Docx en Python
-
iPython.splay Install
-
Cómo instalar Python Dill
-
instalar FastText Python
-
Brew instalar pip python3
-
Cómo instalar Arcade en Python
-
Instalar django en Windows
-
Instalación de TensorFlow con conda
-
Cómo instalar TensorFlow en la CPU de Windows
-
Python Talib Instalar Windows
-
Python install BigQuery
-
Instale Pip Python
-
instalar audio simple en python
-
Mensaje de error de Windows Python
-
Cómo instalar API en Python
-
Instalar cobertura python
-
Cómo instalar Pip ubuntu python2
-
PIP install Python 3
-
Cómo instalar Pyinstaller
-
Cómo instalar matplotlib
-
Instale Google Cloud Python
-
conda instalar pypy
-
Cómo instalar ffmpeg python heroku
-
Instale Python3 en Dockerfile
-
Instalación de pitón aerodinámico
-
instalar Fastapi
-
Comandos de terminal para instalar python en cpanel
-
gaflink install python jupyter
-
instalación de Panda Python
-
instalar Python Altair
-
PIP instale virtualenv Windows
-
Cómo instalar el paquete fuera de línea
-
¿Cómo instalar paquetes fuera de línea? Pregunta
-
Instalación del paquete Pip Offline
-
Error de chatbot de Python
-
Cómo instalar Python Pyautogui
-
Instalar requisitos.txt python
-
instalar Ansible con PIP
-
Cómo instalar Pandas-Profiling
-
instalar easygui conda
-
Error de tipo de impresión Python
-
intente excepto el error de decodificación JSON
-
Mientras activaba envé, muestra un error de acceso a no ya -utorize en VScode
-
PIP Instalar contracciones
-
instalar OS Conda
-
Error de captura en Mongo Query Python
-
Instalar requisitos.txt en Anaconda
-
instalación de transmisión
-
Instalar el paquete Arch Python
-
Instalación de cuaderno Python Pip Jupyter
-
Paquete de instalación de la consola de Python
-
Python verifica si la entrada () da error
-
Ventana de instalación de Python Scapy
-
Instale Scrapy en Pycharm
-
Cómo omitir el error Python
-
instalar ide python ubuntu
-
Cómo instalar inactivo en Ubuntu 20.04
-
Comando de instalación del genorador de nombre de Python
-
python install pandas
-
instalación del filtro django
-
Python -M PIP Instalar
-
Instale Python Windows PowerShell
-
Python 3.7 Instalar Snakemake
-
Cómo instalar Python 3.6.0 en Debian
-
Cómo instalar Tkinter en Pycharm
-
instalar python ubuntu
-
Python install GraphViz y
-
Manejo de errores de frasco
-
Comando para instalar Python3.6 en Mac OS
-
Instale Python3.6 en Linux
-
Instalar discord.ui en Windows
-
Instale Pip 2 en Ubuntu Linux
-
Frasco de la página de error de edición
-
Python Instalar ProgressBar
-
Cómo personalizar el mensaje de respuesta de error SimpleJWT en Django Restframework
-
importar pycocotools._mask como _Mask Error esperado 80, obtuvo 88
-
Tabla de error de Django ya existe
-
OPKG instalar python-lxml_2.2.8-r1_mips32el.ipk
-
Cómo matar un script si el error es presionado python
-
Cómo instalar Pandas para AWS Sam Local
-
instalación de Python Kiwi
-
Error de personaje de Python Unicode
-
Desde imblearn.over_sampling Error de smote de importación
-
Error de sesgo medio
-
Configuración de Python2 en la ruta para la instalación de NPM
-
Instalar el paquete Apriori Python
-
Ocultar demasiado en PIP Instalar
-
instalar imgkit py
-
Cómo instalar dependencias Python
-
navegador = webdriver.firefox () Error
-
Instale diferentes versión de Python Debian
-
PIP Instale Pandas obteniendo requisitos para construir Wheel
-
stackoverflow: instale la versión antigua de NetworkX
-
PIP Instalar Pandas sintaxis inválida
-
Instale Pytorch en Nvidia Jetson NX
-
Cómo instalar ffmpeg_streaming en python
-
Centos install Python 3.9 thelinuxterminal.com
-
Instale Python 3.4 Mac Terminal
-
SystemError: retorno de error sin excepción establecida
-
Cómo instalar una python Packagae
-
advertencias de Python como error
-
hwo a excepto todos los errores en Python Pry Statemen
-
Cómo instalar paquetes de Python en el directorio local
-
Instale el paquete local Python
-
instalación pyttsx3
-
Error de 400 Error Python
-
Error de conversión de Python Catch int
-
Instale Python 3.7 desde la fuente en Ubuntu Linux
-
instalar OpenCV
-
Cómo instalar un entorno virtual en Python
-
Error de instalación de la tubería de medios: no pudo encontrar una versión que satisfaga el requisito MediaPipe (de versiones: ninguno)
-
Biblioteca de instalación de Colab
-
PIP install colab
-
Repl.it Instalar paquetes Python
-
Instale Python MacOS Catalina
-
instalar django
-
python -m pip install -r requisitos.txt
-
Error de Python
-
Cómo instalar Python
-
Error de importación circular
-
Error Python
-
PIP install Python
-
Anaconda install python
-
instalar tortuga python mac
-
PIP Install Rejson
-
Cómo instalar pandas en python por git
-
Instalar pygmt en anaconda indicador
-
Error de sintaxis de Python Jedi
-
RuntimeError: Error en el cálculo de la triangulación de Qhull Delaunay: datos de entrada singular (ExitCode = 2); Use la opción Python Levet (-V) para ver el error Qhull original.
-
Pandas MySQL Error en consulta concats con el espacio
-
Instale Python 3 Ubuntu 16.04
-
Error de sangría en el editor de Python Atom
-
Error fuera de uno en Python
-
Error de la bifurcación de Python
-
clasificación de instalación
-
Beaglebone install Python 3.7
-
Error en el comando de configuración de matplotlib: use_2to3 no es válido
-
Error de objeto httpponse en View.py
-
Colab no entrenando siempre dando a CUDA Error fuera de memoria.
-
instalación de FunccTools Python
-
Error absoluto medio en la fórmula de aprendizaje automático
-
Manejo de errores de valor
-
Error cero
-
instalar iris
-
La aplicación Django WSGI no se pudo cargar error de importación del módulo
-
instalar clasificación
-
Instalar solicitudes-HTML con conda
-
Error de sangría Python
-
instalar Mangadex Python
-
PIP Instalar Tiempo Python
-
Cómo instalar Python en el código Visual Studio
-
Python install jedi
-
Instale Kivymd de Git
-
Instale el módulo Python Glob en macOS usando PIP
-
error adicional
-
Error de Python DT solo se usa con valores de DataTimElike
-
Instalar solicitudes-HTML en Jupyter Notebook
-
Error al cuadrado medio en la fórmula de aprendizaje automático
-
Comando para instalar la voluptuosa biblioteca de Python
-
El PD no está definido por error de Python
-
Instale Pythong en ubicación personalizada
-
Bar Plot Seborn sin barras de error
-
Django Brutebuster Error falló intentos
-
ConfigParser Error al leer la ruta del archivo relativo
-
Jetson NX no puede instalar matplotlib
-
Django dos kilómetros extranjeros al mismo error de administrador del modelo
-
Instale el módulo de globo en Linux
-
Error 302 Heroku Django
-
ruta de instalación django encontrada
-
Cómo instalar el módulo aleatorio en Python
-
Instale Python 3.10 Pip
-
Manejo de errores de Django
-
Instale las solicitudes-HTML en Linux
-
Error de dominio de matemáticas Python
-
Excepción de error de valor
-
Instale Python 3.6
-
Cómo instalar el paquete en Python Shell
-
Error cuadrado medio de raíz en la fórmula de aprendizaje automático
-
Instale el controlador en primera persona Python
-
miktex python install linux
-
Instale matplotlib en Nvidia Jetson NX
-
Error de excepción de Python vs
-
Error de condición previa TensorFlow Predicta
-
Error de OpenCV [Warn: 0] Terminar la devolución de llamada de Async
-
Instale Eric6 Python IDE Ubuntu 20.04
-
ERROR DEL PERMEDIO_HOSTS ECS DJANGO
-
Django Error que muestra la página de imágenes no encontrada
-
instalar nsml python
-
OpenCV Python Instalar Windows
-
Instale Python3 Yum Centos Redhat
-
Error de verificación de archivo de archivo de Python
-
Slack Bot Error no_in_channel
-
Instalar Formio Data Python Biblioteca
-
Error de cromedriver no detectado de selenio
-
Módulo de instalación de PIP para una versión específica de Python
-
#Comandos de instalación de PIP
-
Instalación de lamentos
-
Instale PyImageSearch Python3
-
Cómo instalar el módulo del sistema operativo en Python
-
Instale las solicitudes-HTML Modlule Haga clic en el enlace para obtener más información sobre las solicitudes-HTML
-
Cómo instalar automático Geckodriver en Selenium Python con .install ()
-
Instale Geopandas en el cuaderno Jupyter
-
Error vacío de Python Multiprocessing Queu
-
instalar wget en anaconda
-
Error de flotación Python
-
Instale Pip Python 3.9
-
Instale módulos de Python sin PIP
-
corrige el error cuando cierra la pantalla de tortuga en tu propio bucle principal
-
Cómo instalar OpenCV para Python 3.7.3
-
Para instalar una versión específica, escriba el nombre del paquete seguido de la versión requerida:
-
elevar httperror (req.full_url, código, msg, hdrs, fp) urllib.error.httperror: http error 429: demasiadas solicitudes
-
Uso de la biblioteca de rastreo de anillo para pasar un error
-
Python Escribir al flujo de errores
-
Instalar tabula
-
Python NLTK Error de búsqueda Recurso OMW-1.4 no encontrado.
-
Instalar complementamente manualmente
-
Pantalla de tortuga Cerrar corrección de error
-
Error de dictes múltiples
-
Cómo instalar Python en Linux Chromebook
-
Error de Python Synta
-
Error de región cuando se usa la cuenta de servicio JSON File DatapROC
-
Esta línea es obligatoria para agregar en cualquier momento que desee usar la biblioteca PyGame. Debe agregarse antes de cualquier otra función de pygame, de lo contrario, puede ocurrir un error de inicialización.
-
Instale una versión inferior de Python usando conda
-
Instale Open3D Jetson Nano Aarch64
-
Error de selenio 403 Python
-
Instalación de PIP
-
Visual Studio Code Pylint: Error cuando todo está bien
-
Django REST Framework Relación de clave externa Error en serializador
-
Python Derivative del error cuadrático medio
-
Error de DataProc Initialization_actions
-
Brew instalar python@2
-
Captura de scrape: descarga de errores
-
Python Error Captura de módulos
-
Cadena de Python: error de índice
-
La columna de error de Django last_login no puede ser nula
-
Error de análisis ASN1 al intentar conectarse a Mongo Atlas
-
Error HTTP 403: Correo electrónico de registro de la cuenta de Django Prohibido
-
Cómo instalar automáticamente los paquetes de Python
-
Python Numpy ASArray_ChkFinite Función Ejemplo aumenta el error de valor
-
Instalación de IterTools Python
-
Instalar el frasco de la aplicación de autenticación social
-
PIP Instale matplotlib.pyplot
-
PHOW para instalar módulos de Python en Internet en Sercer
-
Oauthlib Python Error
-
Instale Python2 y Python 3
-
Django Instalar Whitenoise
-
instalación de Pycav
-
escribo nano en python y obtengo error
-
Marco de descanso de error de atributo
-
Cómo instalar pywhatkit en pycharm
-
instalar entornos virtuales_brew
-
error de permiso
-
Instale Python Anaconda
-
Captcha.Image Install en Python
-
instalación de AIML Python
-
Instale PIP y agregue un entorno virtual al kernel de Python
-
Si el error de la función grepper
-
Agregar mensaje de error en django loginrequiredmixin
-
Verifique e instale la versión de Chromedriver apropiada para Selenium usando Python
-
Cálculo de error R-cuadrado y MNSE
-
Error HTTP 403: Django prohibido usando sendGrid
-
módulo no se encuentra después de la instalación exitosa
-
keras.utils.plot_model sigue diciéndome que instale pydot y graphviz
-
Directorio de instalación de impresión de Python
-
¿Qué significa cuando recibo un error de permiso en Python?
-
Error estándar de la media
-
Cómo instalar httplib en python
-
Instalar solicitudes-HTML
-
matplotlib.pyplot Python Instalar
-
Python Pyaudio Error
-
sudo apt-get install python2-pip
-
instalación de chocolate
-
almohada de instalación de PIP
-
Error unicode Python
-
Instalar Web3 en Python
-
Error de valor de Python
-
Instale múltiples versiones de Python
-
Python Escribir error al archivo
-
Django Forms Error personalizar
-
La estética de error debe ser de longitud 1 o lo mismo que los datos (3) rellenar
-
Corrección de errores del código
-
PIP Install no sucede en Python CMD
-
Error de Unocodo Pytonn
-
hpw tp install discord.py
-
PIP Instale la piscina Proxy Scrapy
-
Más respuestas relacionadas con “Instale el error de PocketSphinx” en Python
-
Verifique si se instala TensorFlow GPU
-
Python RuntimeError: tf.placeholder () no es compatible con la ejecución ansiosa.
-
XLRDERROR: archivo Excel XLSX; No soportado
-
pytube.exceptions.regexMatchError: get_throttling_function_name: no pudo encontrar coincidencia para múltiples
-
Instalación de PIP
-
Ejecutable_path ha sido desaprobado, pase en un controlador de objeto de servicio = webdriver.chrome (chromedrivermanager (). install ())
-
ValueError: TZ-AWARE DateTime.Datetime no se puede convertir a Datetime64 a menos que UTC = verdadero sitio: stackoverflow.com
-
Pyaudio no instalando ubuntu
-
Línea de comandos ambientaletror
-
instalador de módulos automáticos de Python
-
PACKAGSNOTFoundError: los siguientes paquetes no están disponibles en los canales actuales: - Python == 3.6
-
Verifique la versión de Epython instalada de forma infalible
-
ls.ProgrammingError: permiso denegado para la tabla django_migrations
-
Importor: ningún módulo llamado Builtins
-
Instalación de yfinance usando PIP
-
No se detectó la instalación de Python 3.10
-
Rueda de instalación de Linux Python
-
AttributeRorRor: esta instancia de consulta es django inmutable
-
ImporterRor: el módulo dinámico no define la función de exportación de módulos (pyinit_cv_bridge_boost)
-
Instalación de la criptografía de Python
-
ImporterRor: No se puede importar el nombre de JSON de ItsDangero
-
Pytasseract Tesseract no está instalado
-
Pip desinstale todos los paquetes
-
Instalación de WXPython en Windows 10
-
SyntaxError: código no UTF-8 que comienza con
-
Importor: ningún módulo llamado django.core.wsgi
-
ValueError esperado La matriz 2D obtuvo una matriz 1D en lugar de una regresión lineal de Python
-
RuntimeError: intentar deserializar el objeto en un dispositivo CUDA pero atorch.cuda.is_available ()
-
FIJO IMPORTERROR: Ningún módulo llamado PIL
-
keyError dismido_count Pafy
-
Lookuperror: Codificación desconocida: Idna Python
-
Linux desinstala Python
-
RecursionerRor Máxima profundidad de recursión
-
Importor: ningún módulo llamado user_agent
-
Importador: no podría
-
AssertionError: el campo relacional debe proporcionar un argumento `QuerySet`, anular` get_queryset` o establecer read_only = `true
-
para E en p.event.get (): pygame.error: sistema de video no inicializado
-
desinstalar poesía
-
ValueError: no se pudo convertir una matriz numpy a un tensor (flotador de tipo de objeto no compatible).
-
manejar errores en el frasco
-
Autorror de frascos
-
Ubuntu no puede encontrar la instalación de Python
-
_CSV.Error: campo mayor que el límite de campo (131072)
-
desinstalar python3.8 ubuntu
-
Error de python2 iónico: no encontrado: python2
-
Verificar se ha instalado Django
-
flor de apio NotimplementError
-
cv_bridge.core.cvbridgeError: [8uc4] no es un formato de color. Pero [BGR8] es. La conversión no tiene sentido
-
Python especificar la salida de typeError
-
Python/Docker ImporterRor: No se puede importar el nombre JSON de ItsDangero
-
dividir por cero errores al usar anotar
-
Entrada de nombre de Python
-
Pyinstaller para el código de Spacy
-
ValueError: Numpy.ndArray Tamaño cambiado, puede indicar incompatibilidad binaria. esperado 88 del encabezado C, obtuvo 80 de Pyobject
-
ValueError: puede haber como máximo 1 encabezados sujetos en un mensaje
-
Oserror: no se puede escribir en modo RGBA como JPEG Python
-
Importor: ningún módulo llamado _bootlocale
-
FutureWarning: Imagen de entrada dtype es bool. La interpolación no se define con el tipo de datos de bool. Establezca el pedido en 0 o explícitamente la imagen de entrada a otro tipo de datos. A partir de la versión 0.19 se planteará un ValueError en lugar de esta advertencia.
-
Instalación de Django Celery Beat Pip
-
No se pudo construir ruedas para OpenCV-Python que usan PEP 517 y no se pueden instalar directamente
-
smtpauthenticationError
-
ValueError: los logits y las etiquetas deben tener la misma forma ((ninguna, 1) vs (ninguno, 2))
-
[Resuelto] typeError: no se puede multiplicar la secuencia por no intento de type str
-
WinError 5 Access se niega PIP
-
Instalación de más módulos en Pypy
-
TypeError: Sitio de objeto de cadena esperada o bytes: stackoverflow.com
-
ImporterRor: libgl.so.1: No se puede abrir el archivo de objeto compartido: no hay dicho archivo o directorio
-
Emisión de pandas typeError: no hay datos numéricos para trazar
-
django.db.utils.operationalError: no hay tal tabla:
-
Pyinstaller Single File
-
ImporterRor: no se puede importar el nombre ABC
-
Instalación de Fastapi
-
Error: la rueda de construcción fallida para almohada
-
Windows de instalación de Pytest
-
Verifique los paquetes instalados de PIP dentro de Virtualenv
-
SSL.SSLCertVerificationError: [SSL: certificate_verify_failed] Verificar el certificado Falta: No se puede obtener el certificado del emisor local (_ssl.c: 1091)
-
Importor: ningún módulo llamado EasyDict
-
TypeError: las excepciones deben derivar de BaseException
-
Paquetes instalados de Python Update
-
comando pyinstaller
-
Versión de Python instalada en Ubuntu
-
SystemError: el mosaico no puede extenderse la imagen externa
-
Desinstalar todos los paquetes Python
-
Cómo verificar qué versión de Python está instalada
-
UnboundLocalError: variable local
-
Error del sistema operativo: conexión rechazada, errno = 111, dirección = 127.0.0.1, puerto = 43350
-
Error de CUDA: afirmación del lado del dispositivo activado
-
ValueError: `logits` y` etiquetas` deben tener la misma forma, recibida ((ninguno, 2) vs (ninguno, 1)).
-
Cómo desinstalar Python inactivo en Ubuntu
-
TypeError: los objetos unicode se deben codificar antes del hash
-
Instalación de paquetes de requisitos.txt archivo
-
TypeError: no puede desempaquetar el objeto int no iterable
-
Mac ¿Por qué se instala Python en USR y aplicación?
-
PIP no es un comando por lotes, pero Python está instalado
-
módulo instalado pero no encontrado python
-
Python ignora unicodedecodeerror
-
Cómo saber dónde se instala Python en Windows
-
Importador: el módulo dinámico no define la función de exportación de módulos
-
ImporterRor: no hay solicitudes de módulo con nombre
-
Importador: ningún módulo llamado Flask
-
RuntimeError: Broken Toolchain: no se puede vincular un programa C simple C
-
CMD Verifique si Python está instalado
-
Instalación de Django
-
ValueError: con n_samples = 0, test_size = 0.2 y Train_size = None, el conjunto de tren resultante estará vacío. Ajuste cualquiera de los parámetros antes mencionados.
-
NameError: el nombre PD no está definido
-
Cómo reinstalar un paquete de Python
-
Importador: ningún módulo llamado Colored
-
DataFrame KeyError:
-
python mysqlclient no instalar
-
Problema typeError: no puede multiplicar la secuencia por no intento de tipo STR
-
TypeError: secuencia elemento 0: instancia str esperada, int encontrado
-
Importador: la carga DLL falló al importar Win32File: no se pudo encontrar el módulo especificado.
-
Importador: la carga DLL falló al importar Win32API: no se pudo encontrar el procedimiento especificado.
-
Cómo verificar si se instala Django (en Python Shell)
-
Python 3.9.5 Actualización instalada Versión predeterminada
-
ValueError: formas (ninguna, 1) y (ninguno, 11) son keras incompatibles
-
¿Dónde están instaladas las bibliotecas de Python en Windows?
-
TypeError: forma inválida (3, 32, 32) para datos de imagen
-
ValueError: columnas se superpone pero no hay sufijo especificado:
-
TypeError: el objeto float no se puede llamar
-
Ningún módulo llamado Pyinstaller
-
Taberror: uso inconsistente de pestañas y espacios en la muescas
-
IndexError: índice no válido de la variable escalar.
-
Cómo desinstalar Python2.7 de Ubuntu 18.04
-
ValueError: matriz encontrada con DIM 3. Estimador esperado
-
Problema AtributeError: Numpy.ndArray Object no tiene un índice de atributo
-
Error: Wheel de construcción fallida para Python-LDAP
-
TypeError: strptime () argumento 1 debe ser str, no series
-
Información de la versión Pyinstaller Exe
-
Instalación del módulo Python desde el código dentro del código
-
intente excepto keyError
-
Pip se desinstaló
-
UnicodeDecodeError UTF8 Codec Cant Decode Byte Byte Pandas
-
SognationError: sangría inesperada
-
Desinstalar completamente Python y todos los VritualEnvs de Mac
-
UnicodeDecodeError: UTF8 Codec Cant Decode Byte
-
Mostrar el lugar Python está instalado.
-
Ignorar errores o advertencias de pytest
-
Cómo registrar errores mientras la depuración es falsa en django
-
archivo unicodeDecodeError leído
-
python criar typeError
-
Cómo arreglar ValueError en Python
-
Directorio de trabajo actual de Pyinstaller OneFile
-
Python Cómo ver qué paquetes PIP están instalados
-
AT = Código de error = H10 DESC = APP Crasado Python Flask
-
win64pyinstaller
-
Instalación de bibliotecas requeridas en el entorno de conda
-
Pip desinstalado
-
xml.parsers.EXPAT.EXTERROR: no bien formado (token inválido): línea 1, columna 0
-
SyntaxError: el argumento posicional sigue el argumento de palabras clave
-
Desinstalar un paquete Python de VirtualEnv
-
¿Dónde está instalado Python en Ubuntu?
-
sqlite3.programmingError: número incorrecto de enlaces suministrados. La declaración actual usa 1, y hay 7 suministrados.
-
FileExistsError: [ERRNO 17] El archivo existe:
-
Instalación de Python Num2Words
-
No se encuentra la aplicación de Python, verifique sus registros de inicio en busca de errores
-
Error: el comando erróneo con el estado de salida 1
-
Error: getAddrinfo enotfound www.python.org www.python.org:443 Descargar Python falló. Error: {Error: getAddrinfo enotfound www.python.org www.python.org:443
-
ImporterRor: no se puede importar el nombre incluir
-
No hay aplicación instalada con etiqueta
-
Instalación de Intel Python
-
Error: no bien formado (token no válido)
-
Por qué Pytest no devuelve el módulo
-
Eoferror: eof al leer una línea
-
Desde django.core.management import execute_from_command_line ImporterRor: ningún módulo llamado django.core.management
-
IntegrityError Import en Django
-
IntegrityError
-
Instalación de Python3.9 en Linux Mint 20
-
Cómo desinstalar Python
-
OSError: [ERRNO 98] Dirección ya en uso
-
Tengo dos versiones de Python instalada Mac
-
Oserror: enlace de servicio cruzado no válido
-
ValueError: la dimensión de datos de consulta debe hacer coincidir la dimensión de datos de entrenamiento
-
ValueError: no se puede remodelar la matriz del tamaño 98292 en forma (16382,1,28) Sitio: stackoverflow.com
-
Cómo desinstalar python-dotenv
-
¿Cómo crear un script de Python para automatizar la instalación de software?
-
ValidationError Django Params
-
Obtuve AttributeRorror al intentar obtener un valor para el campo Nombre` en Serializer
-
ValueError: Literal no válido para int () con base 10: Sitio: stackoverflow.com
-
Instala Pipenv
-
Python ValueError: matriz de tamaño cero a operación de reducción máxima que no tiene identidad
-
BasesshtunnelforwarderError: no pudo establecer sesión en SSH Gateway
-
Instalación de Python 3 a Linux
-
Cómo mostrar fuentes tkinter instaladas
-
¿Qué son los errores de postcondición en Python?
-
Python Habilitar errores de Pyqt
-
Cómo desinstalar el paquete Python
-
Python Wifi Moudel [WinError 2] El sistema no puede encontrar el archivo especificado
-
Instalación de Uvicorn con solo dependencias puras de Python
-
desinstalar cada paquete en el entorno
-
Instalación de Intel-Numpy
-
Sqlalchemy IntegrityError
-
Lista de Pakages instalados en Python
-
Bash Verifique si está instalado el paquete Python
-
RuntimeError: configure el modo de numeración de pin usando gpio.setmode (gpio.board) o gpio.setMode (gpio.bcm)
-
Python eleva FileNotfoundError
-
Pyinstaller Agregar archivos
-
error de tecleado:
-
Desinstalar Python usando PowerShell
-
TypeError: el objeto de tipo dictproxy no es serializable
-
excepto filenotfoundError
-
Se debe instalar PROJ 4.9.0.
-
Instalación de Uvicorn para Fastapi
-
django.db.utils.integrityError:
-
Python Global Variable UnboundLocalError
-
TypeError: DICT no es una secuencia
-
PermissionError: [Errno 13] Permiso denegado en Flask
-
Desinstalar Python Ubuntu 18.04
-
ModulenotfoundError: no se nombra módulo
-
Importor: ningún módulo llamado Pandas
-
TypeError: está prohibida la asignación directa al lado directo de un conjunto de muchos a muchos. Use .set () en su lugar
-
Pyinstaller
-
MultivaluDictKeyError django
-
django-multivalueDictKeyError-error
-
typeError: objeto esperado Str, bytes u Os.
-
Errores de registro en correos electrónicos
-
plt.imshow typeError dimensiones no válidas para datos de imagen
-
Configuración de Python install_requires WHL
-
Cómo atrapar el cudastero
-
Manejo de errores mientras usa el método OS.MakedIrs ()
-
AttributeRorRor: módulo
-
Web3.py falla no instalando
-
ValueError: matriz dispersa esperada con valores enteros, valores de flotación encontrados
-
de sklearn.metrics importan mean_square_error
-
Error de pitón fatal: no se puede recuperar del desbordamiento de la pila.
-
El comando planteó una excepción: typeError: discord.py
-
Instalación de AutoScrapper
-
sqlite3.operationalerRor no hay tal versión de columna
-
RuntimeError: Objeto esperado de tipo Torch.floattensor pero se encuentra tytorch.cuda.floattensor para el argumento
-
Errores de sintaxis de Python
-
pyinstaller pymssql
-
[Resuelto] pandas typeError: no hay datos numéricos para trazar
-
Desinstalar Python 2.7 en Ubuntu
-
ValueError: Y_true y Y_Pred contienen diferentes números de clases 6, 2. Proporcione las etiquetas verdaderas explícitamente a través del argumento de etiquetas. Clases encontradas en y_true: [0 1 2 3 4 5]
-
** (argumenterRor) Las listas en Phoenix.html y las plantillas solo pueden contener enteros que representan bytes, binarios u otras listas, obtuvieron entrada no válida:
-
El valor no es un dict (type_error.dict) válido (type_error.dict) Respuesta_Model Fastapi
-
Instalación de BlackSheep
-
django.db.utils.ingrityError: no la restricción nula falló
-
Cómo resolver los errores de importación mientras intenta implementar el frasco usando WSGI en Apache2
-
Instalación de Pandas en Python2
-
He instalado módulos Python pero Pycharm no puede ejecutar
-
Instalación de Python3.8 en RPI
-
Errores que obtendrá durante el objeto de fecha en Python DateTeMe
-
django.db.utils.ingrityError: la columna contiene valores nulos
-
NameError: el nombre NP no está definido
-
Restaurar TF Modelo Python ValueError: Función de pérdida desconocida: Smoothl1
-
Instalación de PIP en Pytho
-
Error de frasco: werkzeug.routing.builderror
-
ValueError: se debe especificar inicial_value. Sitio: stackoverflow.com
-
Error: 1408f10b: rutinas SSL: SSL3_GET_RECORD: número de versión incorrecto
-
pip_install_packages2.bat
-
RuntimeError: use tf.experimental.tensorrt.converter en TF 2.0. Sitio: stackoverflow.com
-
django.db.utils.programmingerror: (1146
-
Importador: ningún módulo llamado Pip
-
python typeError: la función toma argumentos posicionales pero se les dio
-
TypeError: secuencia elemento 1: instancia STR esperada, no se encontró
-
ValueError: solo un elemento se pueden convertir en tensores a Python Scalars
-
RuntimeError: la entrada debe tener 3 dimensiones, Got 4 Site: stackoverflow.com
-
Python ValueError en strpTime ()
-
Errores críticos Python
-
ValueError: todas las cadenas deben ser compatibles con XML: unicode o ASCII, sin bytes nulos o caracteres de control
-
Instalación de paquetes privados de Python desde los requisitos.txt
-
Error: la ruta objetivo existe pero no es un directorio, no continuará.
-
Errores que recibirá en la clase de tiempo en Python DateTeMe
-
Importador circular: no se puede importar el nombre
-
Imagen raspiana con Python3 preinstalado
-
Oserror TraceBack (la última llamada reciente)
-
IndexError: Índice de asignación de lista fuera de rango
-
TAR: Salir con el estado de la falla debido a errores anteriores
-
RPI PIP3 instalación
-
Errores de tiempo de ejecución en Python
-
Errores de correo electrónico de administración
-
RuntimeError: DataLoader Worker (PID (s) 13615) salió inesperadamente
-
comando errado con el estado de salida 1:
-
Se ha producido una excepción: FileNotFoundError
-
Python Polyfit con errores
-
KeyError: 0 Python
-
Instalación de IntelPyThon3_Core usando Anaconda
-
El paquete de verificación está instalado por Conda o Pip Entorno
-
Python KeyError
-
Myshop Flower NotimplementError
-
Error: Directorio no vacío @ dir_s_rmdir - /usr/local/cellar/python/3.7.3
-
ImporterRor: Sys.Meta_Path es ninguno, Python probablemente se apaga
-
Pytest RuntimeError: no se encontró ninguna aplicación. Trabaje dentro de una función de vista o presione un contexto de aplicación
-
[Resuelto] AtributeError: Numpy.nDarray Object no tiene un índice de atributo
-
ValueError: no se pudo convertir una matriz numpy a un tensor (tipo de objeto no compatible int).
-
Python SyntaxError: personaje inesperado después del carácter de continuación de la línea
-
Django bucle a través de errores de formulario
-
ValueError: desconocido no es compatible en sklearn.rfecv
-
Esquemas de errores de decodificación de Python
-
Cómo encontrar todos los paquetes instalados en Python
-
aiohttp.client_exceptions.clientconnectorCertificateError
-
Problema TypeError: Numpy.float64 El objeto no puede interpretarse como un entero
-
TemplatesyntaxError
-
Desinstalar Python3 de la fuente en Centos 7
-
Deshabilitar errores de consola Chrome selenium
-
Cómo rinstalll re
-
OPENCV (3.4.11) Error: fallado de afirmación (_img.rows * _img.cols == vecsize) en cvcascadeimagreeader :: posader :: get
-
ValueError: proporcione un nombre de TPU para conectarse. Sitio: stackoverflow.com
-
elevar KeyError (clave) de ninguno de los osos.
-
IndexError: índice infantil fuera de rango en el análisis XML para la detección de objetos
-
TypeError: strpTime () argumento 1 debe ser STR, no en lista
-
Asyncio RuntimeError: el bucle de eventos está cerrado
-
Errores mientras se usa el método OS.MakedIrs ()
-
Cómo verificar si una lista aumenta IndexError pero wihing a If Declary Python
-
TypeError: __init __ (): argumentos de constructor incompatibles. Se admiten los siguientes tipos de argumentos: 1. tensorflow.python._pywrap_file_io.bufferedInputStream (arg0: str, arg1: int)
-
urllib_errors
-
Python no se muestra en el panel de control pero no se muestra instalado
-
Dónde encontrar la ubicación de dónde está instalado Python Linux
-
ValueError: no se puede convertir Float Nan en entero
-
Intervisar la instalación del usuario porque los paquetes de sitio normales no son escritables
-
AttributeRor: STR Object no tiene decodificación de atributo
-
binascii .Error: relleno incorrecto en Python Django
-
AttributeRorRor: __enter__ en Python CDE
-
Autopy Python no instalando
-
Desinstalar Python Kali Linux
-
Instalación de Django en Windows
-
TypeError: no se puede desempaquetar objeto flotante no iterable evaluar
-
ValueError: Tuple.Index (x): x no en tuple
-
RuntimeError: No se puede abrir FeatureClass en Python
-
Installez django-cruds-adminlte
-
La instalación actual de Numpy no pasa una verificación de cordura debido a un error en el tiempo de ejecución de Windows.
-
Verifique el archivo STL en busca de errores en Pyvista
-
gnome-terminal dejó de ejecutarse después de que se instala Python 3.6
-
ValueError: especificador de formato no válido
-
Explore las respuestas de código populares por idioma
Explorar otros lenguajes de código