“Error de DataProc Initialization_actions” Código de respuesta
Respuestas similares a “Error de DataProc Initialization_actions”
Preguntas similares a “Error de DataProc Initialization_actions”
-
ParserError: error de tokenización de datos. E Error: los campos esperados 1 en la línea 87, Saw 2
-
Error de validación de importación en Django
-
Error de instalación de PIP
-
ADVERTENCIA: Hubo un error revisando la última versión de PIP.
-
Cómo imprimir error en intento excepto python
-
Importar error de registro cuadrado medio
-
Python obtenga un número de error de línea
-
Dotenv Error Pip Python
-
Spacy ERROR EN_CORE_WEB_SM
-
Python excepto el error como e
-
Desde Sklearn.Cross_Validation Import Train_test_split Error
-
Error al cuadrado medio Python
-
Divide por error cero Python Exception Manipling
-
Error de CORS en Flask
-
Error de pandas Tokenizing Data.
-
Error de antorcha de instalación de PIP
-
Importar error absoluto medio
-
urllib.error.urlerror:
-
Error SSL de transmisión por línea
-
Sklearn Error de cuadrado medio
-
Trace de error de impresión de Python
-
Python Error Get Line
-
Error del servidor 500 Heroku Django
-
Error del matraz
-
Manejo de errores en Python usando Flask
-
Frasco de manejo de errores
-
Flower no implementado error
-
Error emergente en django no visible
-
Error de Python Magic Windows
-
Discord.py en error de comando
-
error de certificado de python twilio
-
Manejo de errores del conector de copo de nieve
-
de Sklearn.PrecoSing Import StandardsCaler Error
-
Error de importación en el mismo directorio Python
-
El error de la clave extranjera de Django no puede asignar debe ser una instancia
-
El error fatal detectado no pudo ejecutar script
-
MIMETYPE ERROR DJANGO REACT
-
Tensorflow no instalando error
-
Solución de error de matriz de confusión
-
Plantilla de error de renderizado
-
porcentaje de error absoluto medio Python
-
Error advertencia tkinter
-
Calcule la raíz Error cuadrado medio Python
-
Model.Predict ([x_test]) Error
-
Reemplace el error con nan pandas
-
SQLITE Error operacional No hay tal columna
-
trazado de la barra de error Python
-
Error de canal no disponible en condena
-
Error de instalación de Pyaudio Ubuntu
-
Error fatal en el lanzador: no se puede crear el proceso
-
Error Urllib Solicitar ningún atributo
-
Ignorar Error Abrir archivo Python
-
ParserError: error de tokenización de datos. E Error C: esperados 1 campos en la línea 6, Saw 3
-
Error de captura Python
-
El origen remoto ya existe un error git
-
Error de servidor interno 500 Flask de Python
-
Respuesta de error de retorno del frasco
-
Skip Error Python
-
Moviewriter stderr: ffmpeg: error al cargar bibliotecas compartidas: libopenh264.so.5: No se puede abrir el archivo de objeto compartido: no hay dicho archivo o directorio
-
Error de juego
-
Error de juego Python
-
elevar un error de API en la vista de descanso de Django
-
archivos estáticos que no cargan 404 error django
-
El comando de error errado con el estado de salida 1 face_recognition
-
Python Archivo Abrir intento excepto error
-
Catch Data de error con excepto Python
-
urllib.error.urlerror:
-
Error de PIP install Pywhatkit
-
Manejo de errores de Python
-
Seaborn Barplot elimina las barras de error
-
Salida de error de impresión de Python
-
Mensaje de error de Windows Python
-
Error de Mod_wsgi de PIP install
-
Error de chatbot de Python
-
Error de tipo de impresión Python
-
intente excepto el error de decodificación JSON
-
Mientras activaba envé, muestra un error de acceso a no ya -utorize en VScode
-
Error de captura en Mongo Query Python
-
Python verifica si la entrada () da error
-
Cómo omitir el error Python
-
Manejo de errores de frasco
-
Frasco de la página de error de edición
-
Cómo personalizar el mensaje de respuesta de error SimpleJWT en Django Restframework
-
importar pycocotools._mask como _Mask Error esperado 80, obtuvo 88
-
Tabla de error de Django ya existe
-
Cómo matar un script si el error es presionado python
-
Error de personaje de Python Unicode
-
Desde imblearn.over_sampling Error de smote de importación
-
Error de sesgo medio
-
navegador = webdriver.firefox () Error
-
Instale el error de PocketSphinx
-
SystemError: retorno de error sin excepción establecida
-
advertencias de Python como error
-
hwo a excepto todos los errores en Python Pry Statemen
-
Error de 400 Error Python
-
Error de conversión de Python Catch int
-
Error de Python
-
Error de importación circular
-
Error Python
-
Error de sintaxis de Python Jedi
-
RuntimeError: Error en el cálculo de la triangulación de Qhull Delaunay: datos de entrada singular (ExitCode = 2); Use la opción Python Levet (-V) para ver el error Qhull original.
-
Pandas MySQL Error en consulta concats con el espacio
-
Error de sangría en el editor de Python Atom
-
Error fuera de uno en Python
-
Error de la bifurcación de Python
-
Error en el comando de configuración de matplotlib: use_2to3 no es válido
-
Error de objeto httpponse en View.py
-
Colab no entrenando siempre dando a CUDA Error fuera de memoria.
-
Error absoluto medio en la fórmula de aprendizaje automático
-
Manejo de errores de valor
-
Error cero
-
La aplicación Django WSGI no se pudo cargar error de importación del módulo
-
Error de sangría Python
-
error adicional
-
Error de Python DT solo se usa con valores de DataTimElike
-
Error al cuadrado medio en la fórmula de aprendizaje automático
-
El PD no está definido por error de Python
-
Bar Plot Seborn sin barras de error
-
Django Brutebuster Error falló intentos
-
ConfigParser Error al leer la ruta del archivo relativo
-
Django dos kilómetros extranjeros al mismo error de administrador del modelo
-
Error 302 Heroku Django
-
Manejo de errores de Django
-
Error de dominio de matemáticas Python
-
Excepción de error de valor
-
Error cuadrado medio de raíz en la fórmula de aprendizaje automático
-
Error de excepción de Python vs
-
Error de condición previa TensorFlow Predicta
-
Error de OpenCV [Warn: 0] Terminar la devolución de llamada de Async
-
ERROR DEL PERMEDIO_HOSTS ECS DJANGO
-
Django Error que muestra la página de imágenes no encontrada
-
Error de verificación de archivo de archivo de Python
-
Slack Bot Error no_in_channel
-
Error de cromedriver no detectado de selenio
-
Error vacío de Python Multiprocessing Queu
-
Error de flotación Python
-
corrige el error cuando cierra la pantalla de tortuga en tu propio bucle principal
-
elevar httperror (req.full_url, código, msg, hdrs, fp) urllib.error.httperror: http error 429: demasiadas solicitudes
-
Uso de la biblioteca de rastreo de anillo para pasar un error
-
Python Escribir al flujo de errores
-
Python NLTK Error de búsqueda Recurso OMW-1.4 no encontrado.
-
Pantalla de tortuga Cerrar corrección de error
-
Error de dictes múltiples
-
Error de Python Synta
-
Esta línea es obligatoria para agregar en cualquier momento que desee usar la biblioteca PyGame. Debe agregarse antes de cualquier otra función de pygame, de lo contrario, puede ocurrir un error de inicialización.
-
Error de selenio 403 Python
-
Visual Studio Code Pylint: Error cuando todo está bien
-
Django REST Framework Relación de clave externa Error en serializador
-
Python Derivative del error cuadrático medio
-
Captura de scrape: descarga de errores
-
Python Error Captura de módulos
-
Cadena de Python: error de índice
-
La columna de error de Django last_login no puede ser nula
-
Error de análisis ASN1 al intentar conectarse a Mongo Atlas
-
Error HTTP 403: Correo electrónico de registro de la cuenta de Django Prohibido
-
Python Numpy ASArray_ChkFinite Función Ejemplo aumenta el error de valor
-
Oauthlib Python Error
-
escribo nano en python y obtengo error
-
Marco de descanso de error de atributo
-
error de permiso
-
Si el error de la función grepper
-
Agregar mensaje de error en django loginrequiredmixin
-
Cálculo de error R-cuadrado y MNSE
-
Error HTTP 403: Django prohibido usando sendGrid
-
¿Qué significa cuando recibo un error de permiso en Python?
-
Error estándar de la media
-
Python Pyaudio Error
-
Error unicode Python
-
Error de valor de Python
-
Python Escribir error al archivo
-
Django Forms Error personalizar
-
La estética de error debe ser de longitud 1 o lo mismo que los datos (3) rellenar
-
Corrección de errores del código
-
Error de Unocodo Pytonn
-
Más respuestas relacionadas con “Error de DataProc Initialization_actions” en Python
-
Python RuntimeError: tf.placeholder () no es compatible con la ejecución ansiosa.
-
XLRDERROR: archivo Excel XLSX; No soportado
-
pytube.exceptions.regexMatchError: get_throttling_function_name: no pudo encontrar coincidencia para múltiples
-
ValueError: TZ-AWARE DateTime.Datetime no se puede convertir a Datetime64 a menos que UTC = verdadero sitio: stackoverflow.com
-
Línea de comandos ambientaletror
-
PACKAGSNOTFoundError: los siguientes paquetes no están disponibles en los canales actuales: - Python == 3.6
-
ls.ProgrammingError: permiso denegado para la tabla django_migrations
-
Importor: ningún módulo llamado Builtins
-
AttributeRorRor: esta instancia de consulta es django inmutable
-
ImporterRor: el módulo dinámico no define la función de exportación de módulos (pyinit_cv_bridge_boost)
-
ImporterRor: No se puede importar el nombre de JSON de ItsDangero
-
SyntaxError: código no UTF-8 que comienza con
-
Importor: ningún módulo llamado django.core.wsgi
-
ValueError esperado La matriz 2D obtuvo una matriz 1D en lugar de una regresión lineal de Python
-
RuntimeError: intentar deserializar el objeto en un dispositivo CUDA pero atorch.cuda.is_available ()
-
FIJO IMPORTERROR: Ningún módulo llamado PIL
-
keyError dismido_count Pafy
-
Lookuperror: Codificación desconocida: Idna Python
-
RecursionerRor Máxima profundidad de recursión
-
Importor: ningún módulo llamado user_agent
-
Importador: no podría
-
AssertionError: el campo relacional debe proporcionar un argumento `QuerySet`, anular` get_queryset` o establecer read_only = `true
-
para E en p.event.get (): pygame.error: sistema de video no inicializado
-
ValueError: no se pudo convertir una matriz numpy a un tensor (flotador de tipo de objeto no compatible).
-
manejar errores en el frasco
-
Autorror de frascos
-
_CSV.Error: campo mayor que el límite de campo (131072)
-
Error de python2 iónico: no encontrado: python2
-
flor de apio NotimplementError
-
cv_bridge.core.cvbridgeError: [8uc4] no es un formato de color. Pero [BGR8] es. La conversión no tiene sentido
-
Python especificar la salida de typeError
-
Python/Docker ImporterRor: No se puede importar el nombre JSON de ItsDangero
-
dividir por cero errores al usar anotar
-
Entrada de nombre de Python
-
ValueError: Numpy.ndArray Tamaño cambiado, puede indicar incompatibilidad binaria. esperado 88 del encabezado C, obtuvo 80 de Pyobject
-
ValueError: puede haber como máximo 1 encabezados sujetos en un mensaje
-
Oserror: no se puede escribir en modo RGBA como JPEG Python
-
Importor: ningún módulo llamado _bootlocale
-
FutureWarning: Imagen de entrada dtype es bool. La interpolación no se define con el tipo de datos de bool. Establezca el pedido en 0 o explícitamente la imagen de entrada a otro tipo de datos. A partir de la versión 0.19 se planteará un ValueError en lugar de esta advertencia.
-
smtpauthenticationError
-
ValueError: los logits y las etiquetas deben tener la misma forma ((ninguna, 1) vs (ninguno, 2))
-
[Resuelto] typeError: no se puede multiplicar la secuencia por no intento de type str
-
WinError 5 Access se niega PIP
-
TypeError: Sitio de objeto de cadena esperada o bytes: stackoverflow.com
-
ImporterRor: libgl.so.1: No se puede abrir el archivo de objeto compartido: no hay dicho archivo o directorio
-
Emisión de pandas typeError: no hay datos numéricos para trazar
-
django.db.utils.operationalError: no hay tal tabla:
-
ImporterRor: no se puede importar el nombre ABC
-
Error: la rueda de construcción fallida para almohada
-
SSL.SSLCertVerificationError: [SSL: certificate_verify_failed] Verificar el certificado Falta: No se puede obtener el certificado del emisor local (_ssl.c: 1091)
-
Importor: ningún módulo llamado EasyDict
-
TypeError: las excepciones deben derivar de BaseException
-
SystemError: el mosaico no puede extenderse la imagen externa
-
UnboundLocalError: variable local
-
Importor: ningún módulo llamado _tkinter, instale el paquete python-tk
-
Error del sistema operativo: conexión rechazada, errno = 111, dirección = 127.0.0.1, puerto = 43350
-
Error de CUDA: afirmación del lado del dispositivo activado
-
ValueError: `logits` y` etiquetas` deben tener la misma forma, recibida ((ninguno, 2) vs (ninguno, 1)).
-
TypeError: los objetos unicode se deben codificar antes del hash
-
TypeError: no puede desempaquetar el objeto int no iterable
-
Python ignora unicodedecodeerror
-
Importador: el módulo dinámico no define la función de exportación de módulos
-
ImporterRor: no hay solicitudes de módulo con nombre
-
Importador: ningún módulo llamado Flask
-
RuntimeError: Broken Toolchain: no se puede vincular un programa C simple C
-
ValueError: con n_samples = 0, test_size = 0.2 y Train_size = None, el conjunto de tren resultante estará vacío. Ajuste cualquiera de los parámetros antes mencionados.
-
NameError: el nombre PD no está definido
-
Importador: ningún módulo llamado Colored
-
DataFrame KeyError:
-
Problema typeError: no puede multiplicar la secuencia por no intento de tipo STR
-
TypeError: secuencia elemento 0: instancia str esperada, int encontrado
-
Importador: la carga DLL falló al importar Win32File: no se pudo encontrar el módulo especificado.
-
Importador: la carga DLL falló al importar Win32API: no se pudo encontrar el procedimiento especificado.
-
ValueError: formas (ninguna, 1) y (ninguno, 11) son keras incompatibles
-
TypeError: forma inválida (3, 32, 32) para datos de imagen
-
ValueError: columnas se superpone pero no hay sufijo especificado:
-
TypeError: el objeto float no se puede llamar
-
Taberror: uso inconsistente de pestañas y espacios en la muescas
-
IndexError: índice no válido de la variable escalar.
-
ValueError: matriz encontrada con DIM 3. Estimador esperado
-
Problema AtributeError: Numpy.ndArray Object no tiene un índice de atributo
-
Error: Wheel de construcción fallida para Python-LDAP
-
TypeError: strptime () argumento 1 debe ser str, no series
-
intente excepto keyError
-
UnicodeDecodeError UTF8 Codec Cant Decode Byte Byte Pandas
-
SognationError: sangría inesperada
-
UnicodeDecodeError: UTF8 Codec Cant Decode Byte
-
Ignorar errores o advertencias de pytest
-
Cómo registrar errores mientras la depuración es falsa en django
-
archivo unicodeDecodeError leído
-
python criar typeError
-
Cómo arreglar ValueError en Python
-
AT = Código de error = H10 DESC = APP Crasado Python Flask
-
xml.parsers.EXPAT.EXTERROR: no bien formado (token inválido): línea 1, columna 0
-
SyntaxError: el argumento posicional sigue el argumento de palabras clave
-
sqlite3.programmingError: número incorrecto de enlaces suministrados. La declaración actual usa 1, y hay 7 suministrados.
-
FileExistsError: [ERRNO 17] El archivo existe:
-
No se encuentra la aplicación de Python, verifique sus registros de inicio en busca de errores
-
Error: el comando erróneo con el estado de salida 1
-
Error: getAddrinfo enotfound www.python.org www.python.org:443 Descargar Python falló. Error: {Error: getAddrinfo enotfound www.python.org www.python.org:443
-
ImporterRor: no se puede importar el nombre incluir
-
Error: no bien formado (token no válido)
-
Por qué Pytest no devuelve el módulo
-
Eoferror: eof al leer una línea
-
Desde django.core.management import execute_from_command_line ImporterRor: ningún módulo llamado django.core.management
-
IntegrityError Import en Django
-
IntegrityError
-
OSError: [ERRNO 98] Dirección ya en uso
-
Oserror: enlace de servicio cruzado no válido
-
ValueError: la dimensión de datos de consulta debe hacer coincidir la dimensión de datos de entrenamiento
-
ValueError: no se puede remodelar la matriz del tamaño 98292 en forma (16382,1,28) Sitio: stackoverflow.com
-
ValidationError Django Params
-
Obtuve AttributeRorror al intentar obtener un valor para el campo Nombre` en Serializer
-
ValueError: Literal no válido para int () con base 10: Sitio: stackoverflow.com
-
Python ValueError: matriz de tamaño cero a operación de reducción máxima que no tiene identidad
-
BasesshtunnelforwarderError: no pudo establecer sesión en SSH Gateway
-
¿Qué son los errores de postcondición en Python?
-
Python Habilitar errores de Pyqt
-
Python Wifi Moudel [WinError 2] El sistema no puede encontrar el archivo especificado
-
Sqlalchemy IntegrityError
-
RuntimeError: configure el modo de numeración de pin usando gpio.setmode (gpio.board) o gpio.setMode (gpio.bcm)
-
Python eleva FileNotfoundError
-
error de tecleado:
-
TypeError: el objeto de tipo dictproxy no es serializable
-
excepto filenotfoundError
-
django.db.utils.integrityError:
-
Python Global Variable UnboundLocalError
-
TypeError: DICT no es una secuencia
-
Error de instalación de la tubería de medios: no pudo encontrar una versión que satisfaga el requisito MediaPipe (de versiones: ninguno)
-
PermissionError: [Errno 13] Permiso denegado en Flask
-
ModulenotfoundError: no se nombra módulo
-
Importor: ningún módulo llamado Pandas
-
TypeError: está prohibida la asignación directa al lado directo de un conjunto de muchos a muchos. Use .set () en su lugar
-
MultivaluDictKeyError django
-
django-multivalueDictKeyError-error
-
typeError: objeto esperado Str, bytes u Os.
-
Errores de registro en correos electrónicos
-
plt.imshow typeError dimensiones no válidas para datos de imagen
-
Cómo atrapar el cudastero
-
Manejo de errores mientras usa el método OS.MakedIrs ()
-
AttributeRorRor: módulo
-
ValueError: matriz dispersa esperada con valores enteros, valores de flotación encontrados
-
de sklearn.metrics importan mean_square_error
-
Error de pitón fatal: no se puede recuperar del desbordamiento de la pila.
-
El comando planteó una excepción: typeError: discord.py
-
sqlite3.operationalerRor no hay tal versión de columna
-
RuntimeError: Objeto esperado de tipo Torch.floattensor pero se encuentra tytorch.cuda.floattensor para el argumento
-
Errores de sintaxis de Python
-
[Resuelto] pandas typeError: no hay datos numéricos para trazar
-
ValueError: Y_true y Y_Pred contienen diferentes números de clases 6, 2. Proporcione las etiquetas verdaderas explícitamente a través del argumento de etiquetas. Clases encontradas en y_true: [0 1 2 3 4 5]
-
** (argumenterRor) Las listas en Phoenix.html y las plantillas solo pueden contener enteros que representan bytes, binarios u otras listas, obtuvieron entrada no válida:
-
El valor no es un dict (type_error.dict) válido (type_error.dict) Respuesta_Model Fastapi
-
django.db.utils.ingrityError: no la restricción nula falló
-
Cómo resolver los errores de importación mientras intenta implementar el frasco usando WSGI en Apache2
-
Errores que obtendrá durante el objeto de fecha en Python DateTeMe
-
django.db.utils.ingrityError: la columna contiene valores nulos
-
NameError: el nombre NP no está definido
-
Restaurar TF Modelo Python ValueError: Función de pérdida desconocida: Smoothl1
-
Error de frasco: werkzeug.routing.builderror
-
ValueError: se debe especificar inicial_value. Sitio: stackoverflow.com
-
Error: 1408f10b: rutinas SSL: SSL3_GET_RECORD: número de versión incorrecto
-
RuntimeError: use tf.experimental.tensorrt.converter en TF 2.0. Sitio: stackoverflow.com
-
django.db.utils.programmingerror: (1146
-
Importador: ningún módulo llamado Pip
-
python typeError: la función toma argumentos posicionales pero se les dio
-
TypeError: secuencia elemento 1: instancia STR esperada, no se encontró
-
ValueError: solo un elemento se pueden convertir en tensores a Python Scalars
-
RuntimeError: la entrada debe tener 3 dimensiones, Got 4 Site: stackoverflow.com
-
Python ValueError en strpTime ()
-
Errores críticos Python
-
ValueError: todas las cadenas deben ser compatibles con XML: unicode o ASCII, sin bytes nulos o caracteres de control
-
Error: la ruta objetivo existe pero no es un directorio, no continuará.
-
Errores que recibirá en la clase de tiempo en Python DateTeMe
-
Importador circular: no se puede importar el nombre
-
Oserror TraceBack (la última llamada reciente)
-
IndexError: Índice de asignación de lista fuera de rango
-
TAR: Salir con el estado de la falla debido a errores anteriores
-
Errores de tiempo de ejecución en Python
-
Errores de correo electrónico de administración
-
RuntimeError: DataLoader Worker (PID (s) 13615) salió inesperadamente
-
comando errado con el estado de salida 1:
-
Se ha producido una excepción: FileNotFoundError
-
Python Polyfit con errores
-
KeyError: 0 Python
-
Python KeyError
-
Myshop Flower NotimplementError
-
Error: Directorio no vacío @ dir_s_rmdir - /usr/local/cellar/python/3.7.3
-
ImporterRor: Sys.Meta_Path es ninguno, Python probablemente se apaga
-
Pytest RuntimeError: no se encontró ninguna aplicación. Trabaje dentro de una función de vista o presione un contexto de aplicación
-
[Resuelto] AtributeError: Numpy.nDarray Object no tiene un índice de atributo
-
ValueError: no se pudo convertir una matriz numpy a un tensor (tipo de objeto no compatible int).
-
Python SyntaxError: personaje inesperado después del carácter de continuación de la línea
-
Django bucle a través de errores de formulario
-
ValueError: desconocido no es compatible en sklearn.rfecv
-
Esquemas de errores de decodificación de Python
-
aiohttp.client_exceptions.clientconnectorCertificateError
-
Problema TypeError: Numpy.float64 El objeto no puede interpretarse como un entero
-
TemplatesyntaxError
-
Deshabilitar errores de consola Chrome selenium
-
OPENCV (3.4.11) Error: fallado de afirmación (_img.rows * _img.cols == vecsize) en cvcascadeimagreeader :: posader :: get
-
ValueError: proporcione un nombre de TPU para conectarse. Sitio: stackoverflow.com
-
elevar KeyError (clave) de ninguno de los osos.
-
IndexError: índice infantil fuera de rango en el análisis XML para la detección de objetos
-
TypeError: strpTime () argumento 1 debe ser STR, no en lista
-
Asyncio RuntimeError: el bucle de eventos está cerrado
-
Errores mientras se usa el método OS.MakedIrs ()
-
Cómo verificar si una lista aumenta IndexError pero wihing a If Declary Python
-
TypeError: __init __ (): argumentos de constructor incompatibles. Se admiten los siguientes tipos de argumentos: 1. tensorflow.python._pywrap_file_io.bufferedInputStream (arg0: str, arg1: int)
-
urllib_errors
-
ValueError: no se puede convertir Float Nan en entero
-
AttributeRor: STR Object no tiene decodificación de atributo
-
binascii .Error: relleno incorrecto en Python Django
-
AttributeRorRor: __enter__ en Python CDE
-
TypeError: no se puede desempaquetar objeto flotante no iterable evaluar
-
ValueError: Tuple.Index (x): x no en tuple
-
RuntimeError: No se puede abrir FeatureClass en Python
-
Verifique el archivo STL en busca de errores en Pyvista
-
ValueError: especificador de formato no válido
-
Explore las respuestas de código populares por idioma
Explorar otros lenguajes de código