“Appium Inspector está recibiendo un error 304” Código de respuesta
Respuestas similares a “Appium Inspector está recibiendo un error 304”
Preguntas similares a “Appium Inspector está recibiendo un error 304”
-
Error Daemon de arranque: error al abrir la base de datos de metadatos del almacén de volumen: tiempo de espera
-
Error de Mac que el puerto ya está en uso
-
Falló en el [email protected] Postinstall Script. NPM ERR! Probablemente esto no sea un problema con NPM. Es probable que haya una salida de registro adicional arriba.
-
El recuento de columnas de mysql.proc es incorrecto. Esperado 21, encontrado 20. Creado con MariadB 100145, ahora ejecutando 100415. Utilice mysql_upgrade para corregir este error
-
Aunque se está ejecutando la extensión de integración de shell GNOME, no se detecta el conector nativo del host.
-
UserWarning: Matplotlib está utilizando actualmente AGG, que es un backend no GUI, por lo que no puede mostrar la figura. plt.show ()
-
Error de PSYCOPG2 Error de instalación de PIP
-
Los metadatos GVFS no son compatibles. Fallback para decirle al gerente de metadatos. O GVFS no está instalado correctamente o los metadatos GVFS no son compatibles con esta plataforma. En el último caso, debe configurar TEPL con --disable-GVFS-Metadata.
-
Este error puede indicar que el Docker Daemon no se está ejecutando
-
No se puede instalar APK en el dispositivo. Asegúrese de que el SDK de Android esté instalado y esté configurado correctamente en el editor.
-
Error de carga WebView: Error: no se pudo registrar los trabajadores del servicio: InvalidStateError: No se pudo registrar un trabajador del servicio: el documento está en un estado no válido
-
El puerto 3000 ya está en uso, pero cuando trato de matar, no se encuentra nada
-
Cómo verificar es Heroku Git Remote se agrega
-
El archivo de configuración es legible por grupo. Esto es inseguro Linux
-
¿Por qué mi db.sqlite3 no es gitignore?
-
La instalación de Flutter Doctor Xcode está incompleta; Una instalación completa es necesaria para el desarrollo de iOS.
-
El recuento de columnas de mysql.proc es incorrecto. Esperado 20, encontrado 16. La tabla probablemente esté dañada
-
La identificación del compilador CUDA es un error de cmake desconocido en cmakelists.txt: 441 (enable_language): no se pudo encontrar CMAKE_CUDA_COMPILER.
-
La carga, el administrador de paquetes de óxido, no está instalado o no está en ruta.
-
Error de instalación del nodo El usuario autenticado no es válido
-
Error a instalar una vaina - error de bus al 0x00000001045b8000
-
WhatsApp está instalado pero no instalado Error en Android
-
Mostrar mensaje de error y salir si $ foo es inseguro (o nulo)
-
Docker Error 2 Las coincidencias que se encuentran en función de la red de nombres es ambiguo
-
es el arranque dual o la VM es mejor para asus rog
-
Los siguientes paquetes tienen dependencias insatisfechas: phpMyAdmin: depende: php-twig (
-
DPKG: paquete de procesamiento de errores libc-bin (-configure): paquete de libc-bin instalado subprocesamiento de subproceso devuelto Error de salida Estado 134
-
Error desde el servidor: Error Backend de marcación: Marque TCP: 10250: Conecte: No hay ruta al host Kubernetes
-
Más respuestas relacionadas con “Appium Inspector está recibiendo un error 304” en Shell/Bash
-
Gnupg, Gnupg2 y Gnupg1 no parecen estar instalados, pero uno de ellos es necesario para esta operación
-
React-scripts no se reconoce como un comando interno de Windows
-
ZSH no está instalado. Instale ZSH primero.
-
Firewalld no se está ejecutando
-
¿Qué es? Use-Feature = 2020-resolver
-
Encuentra qué PID está escuchando en un puerto en particular
-
El subsistema de Windows para el componente de Linux no está habilitado
-
Error Gyp err! Error de pila: no encontrado: hacer
-
phpunit/phpunit [8.5.8, ..., 8.5.x-dev, 9.3.3, ..., 9.5.x-dev] requiere ext-dom *--
-
RM no se reconoce como comando interno
-
Su cuenta está limitada a 1 Sesión simultánea del cliente NGROK.
-
Compruebe si Nginx se está ejecutando
-
Compruebe si Heroku CLI está conectado
-
cómo encontrar la dirección git está empujado
-
El repositorio de especificaciones de Cocoapods está demasiado desactualizado para satisfacer las dependencias.
-
Compruebe si se usa Wayland o X11
-
No se pudo instalar paquetes debido a un OSError: [WinErerror 5] El acceso se niega:
-
Error de sintaxis: typeError: this.getOptions no es una función
-
Cómo verificar qué proceso está utilizando más memoria en Linux
-
Linux ¿Qué proceso está utilizando un puerto?
-
Nginx.service no está activo, no puede recargar.
-
Error a instalar Pyodbc Linux
-
Error de sintaxis de Vuejs Sass: typeError: this.getOptions no es una función
-
comando ssh para obtener qué sabor se usa
-
NPM Install--No-Audit --Save --Save-Exact--Loglevel Error React React-Dom React-Scripts CRA-Template ha fallado.
-
Linux verifique si un puerto está abierto
-
PS1 no está firmada digitalmente. thinwgworx
-
El archivo no está firmado digitalmente PowerShell
-
no está firmado digitalmente. No puede ejecutar este script en el sistema actual
-
no se puede cargar porque ejecutar scripts está deshabilitado en este sistema.
-
Error de fijación de PowerShell
-
yarn.ps1 no está firmado digitalmente
-
Ionic.ps1 no está firmado digitalmente.
-
no está firmado digitalmente. No puede ejecutar este script en el sistema actual.
-
-
-
-
-
-
-
-
-
¿Dónde está el registro de Crontab?
-
No se pudo iniciar Docker.Service: Unit Docker.Service está enmascarado
-
No se pudo reiniciar MongoDB. Servicio: la unidad MongoDB.Service está enmascarado.
-
Docker: Respuesta de error de Daemon: Dial Unix docker.raw.sock: Conecte: No hay dicho archivo o directorio
-
Proceso de control de Nginx salido con el código de error
-
Cómo verificar si MySQL está instalado Ubuntu
-
Cómo verificar que Cron esté funcionando o no
-
Error PIP instalar PSYCOPG2 -Binary LD: Biblioteca no encontrada para -lssl
-
Cómo verificar si Django está instalado en Ubuntu
-
apache2.service no está activo no puede recargar. ubuntu
-
Cómo verificar si se instala la solidez
-
FirebaseCommandException: se produjo un error en la CLI de Firebase al intentar ejecutar un comando.
-
Descubra qué procussis está utilizando Port Linux
-
Verifique si está instalado jQuery
-
NotisplementedError: las teclas OpenSSH solo admitidas si ED25519 está disponible Net-SSH requiere las siguientes gemas para el SUPOR ED25519
-
El error de git necesita fusionar
-
NPM Instale el error de mangosto NPM err! código enoself
-
Error al instalar PSYCOPG2 en Ubuntu 20.04
-
¿Qué es Grepper Contributor Coin (GREPCC)?
-
Excepción: Error en ejecutar la instalación de Pod POD
-
No se pudo iniciar Redis-server. Servicio: Unidad Redis-Server.Service está enmascarado.
-
Xcode no está instalado o no configurado correctamente. Descargar, instalar, configurarlo y ejecutar este script nuevamente
-
Cómo verificar si el puerto está en uso en
-
Verifique si el puerto está disponible Linux
-
Falló el comando: instalación de npm-error-logelvel --legacy-peer-deps
-
Cómo verificar la máquina es de 32 bits o 64 bits Linux
-
Iniciar sesión sin contraseña está prohibido por la configuración (consulte ALOWNOPASSWORD) Ubuntu
-
Compruebe si está instalado OH-My-Zsh
-
cómo verificar si oh mi zsh está instalado
-
Compruebe si Docker se está ejecutando
-
Verifique si está instalado MongoDB
-
Áreas de memoria virtual máximas vm.max_map_count [65530] es demasiado bajo, aumenta al menos [262144]
-
No se puede resolver el error del árbol de dependencia al instalar paquetes NPM
-
El trabajo para apache2.service falló porque el proceso de control salió con el código de error.
-
¿Cuál es mi versión de gnome shell?
-
Las actualizaciones de GIT fueron rechazadas porque la punta de su rama actual está detrás
-
Falló la instalación: descargar fallado. El directorio de destino para la transmisión de archivos no existe o no es escritura.
-
Error de instalación de nodo SASS
-
Steam no está en el archivo de sudoers.
-
PIP instalar PSYCOPG2 Error Fedora
-
SH verifique si el directorio está vacío
-
Se requiere CMake 3.14 o superior. Estás ejecutando la versión 3.13.4
-
Error de inicio de usuarios proxy: escuche TCP4 0.0.0.0:8080: Bind: Dirección ya en uso
-
Error de GYP NPM Instalar
-
wget ignore el error de certificado SSL
-
Verifique que Redis se esté ejecutando
-
Compruebe si Redis se está ejecutando o no
-
Error de compilación de sombreadores de flutter skia
-
Error de compilación del sombreador de errores de flutador
-
Error de compilación de Shader de Chrome Skia
-
Error no pudo iniciar el titiritero del proceso del navegador
-
El controlador del kernel no está instalado (RC = -1908) Asegúrese de que el módulo del kernel se haya cargado con éxito. Dónde: SUPLIBOSINIT What: 3 VERR_VM_DRIVER_NOT_Installed (-1908): el controlador de soporte no está instalado. En Linux, abra Enoent devuelto.
-
Comando para verificar qué versión de Django está instalada
-
Bash verificar si el proceso se ejecuta por nombre
-
Compruebe si Kubernetes se está ejecutando
-
Docker Image no se restablece
-
es el firewall corriendo CentOS 7
-
No se puede iniciar el servicio SSH-Agent, Error: 1058
-
Encuentra qué servicio está usando el puerto
-
¿Es bueno Linux?
-
Error de montaje de dev SDB1 en Media en Ubuntu
-
no pudo encontrar la función xmlcheckversion en la biblioteca libxml2. ¿Está instalado libxml2?
-
Cómo verificar si se instala Cocoapods
-
Vea lo que está usando un puerto ubuntu
-
Cómo verificar si el puerto está abierto Mac
-
¿Qué entorno de escritorio se ejecuta?
-
Bash si es número
-
ruta no válida de error git
-
rxjs_1.lastValueFrom no es una función
-
No se pudo iniciar el archivo Daemon: PID encontrado, asegúrese de que Docker no esté ejecutando o elimine /var/run/docker.pid
-
Cómo verificar si Jenkins se está ejecutando
-
El repositorio no está limpio. Comprometer o guardar cualquier cambio antes de actualizar.
-
Kali Network Manager no se está ejecutando
-
Bash Verifique si el paquete está instalado
-
Ubuntu ver si el paquete está instalado
-
Conductor Error de modo de interfaz de usuario del conductor San Francisco
-
Flutter Linux Cmake Error
-
PSSYCOPG2 ERROR INSTALACIÓN
-
Docker Daemon no está funcionando
-
Cómo verificar si IP está arriba script bash
-
CondavalueError: el prefijo objetivo es el prefijo base. Aborto.
-
La instalación de PIP falla con el error de conexión SSL
-
¿Por qué la fusión está eliminando Gitingore?
-
Pipenv se produjo un error al instalar PSYCOPG2 == 2.8.4
-
Pipenv un error PSYCOPG2
-
SEGURAR COMANDO DE REPOSITORIO ADPT-APT No se encuentra Error en Ubuntu y Debian
-
Python 3.8 instalado pero dónde está Pip
-
La variable de entorno CUDA_HOME no está establecida. Configúrelo en su raíz de instalación CUDA.
-
Está ejecutando `Create-react-app` 4.0.3, que está detrás de la última versión (5.0.0). Ya no admitimos la instalación global de la aplicación Create React.
-
Flutter Doctor-Error de licencias de Android
-
Flutter Doctor-Error de Java de liquidaciones de Android
-
Error de nodo-gipo en Windows 10
-
Error de nodo-ging
-
Problema de Docker con la instalación de CMake, abortando la construcción. CMAKE Ejecutable es CMake
-
¿Dónde está el archivo .zshrc en Mac?
-
Tiempo de espera esperando para bloquear el registro de direcciones de demonio. Actualmente está en uso por otra instancia de Gradle.
-
Bash verificar si el número es mayor que
-
No hay información de seguimiento para la rama actual. Especifique con qué rama desea fusionarse. Ver Git-Pull (1) para más detalles.
-
Error: la extracción no es posible porque tiene archivos inalteres.
-
Compruebe si Firebase está instalado a nivel mundial
-
NPM Warn Depreced [email protected]: Esta versión de TAR ya no es compatible y no recibirá actualizaciones de seguridad. Actualice lo antes posible.
-
No se pudo instalar paquetes debido a un entorno, [WinError 32] El proceso no puede acceder al archivo porque está siendo utilizado por otro proceso
-
trufa.ps1 no está firmado digitalmente
-
Vea si URDF es válido
-
PIP instale el error de django-heroku
-
VSCODE Ejecutar scripts está deshabilitado en este sistema
-
¿Cuál es mi resolución de monitor? Ubuntu
-
Verifique si VirtualBox está instalado Ubuntu
-
Proceso de usuario ejecutivo causado: error de formato ejecutivo
-
Error Instalar Cocoapods
-
Compruebe si MongoDB está ejecutando Mac
-
El comando de error falló con el código de salida 3221225477
-
Encuentre qué proceso está utilizando Port Mac
-
Mac M1 Error ejecutando la instalación de Pod
-
Proporcione un error de ruta de caché válido
-
Error fatal en el lanzador:
-
Líneas de impresión AWK Cuando el partido se encuentra con un campo específico
-
Mac [ncm2_core@yarp] El trabajo está muerto nvim
-
¿Dónde está mi? Git Config Mac
-
Error mientras carga bibliotecas compartidas: libASOund.so.2: No se puede abrir el archivo de objeto compartido: no hay dicho archivo o directorio
-
Excepción: Error de ejecutar la instalación de Pod Flutter en IOD
-
Se requiere autenticación para crear un dispositivo administrado por color
-
Error durante la conexión: en la configuración de demonio predeterminada en Windows, el cliente Docker debe ejecutarse con privilegios elevados para conectarse.
-
El origen remoto ya existe un error
-
Errores bash: error de sintaxis - ambiguo - archivo
-
PM2 Next /usr /bin /hilo: línea 3: /bin: es un directorio
-
Cómo verificar si Matpot está instalado
-
Recibí un error creando la base de datos de prueba: Erreur: Droit Refus Pour Crer Une Base de Donnes
-
Cómo saber que el espacio de nombres está presente o no en el script de shell de Kubernetes
-
Ubuntu verifique si Apache se está ejecutando
-
La clave privada está demasiado abierta
-
Permisos 0644 para están demasiado abiertos. Se requiere que sus archivos de clave privados no sean accesibles por otros. Esta clave privada será ignorada
-
Bash cómo eliminar las filas si el campo específico está en blanco
-
nginx cors solo uno está permitido
-
Verifique qué dominio se está ejecutando Apache
-
Cómo depurar una cápsula específica cuando el controlador de replicación está haciendo un equilibrio de carga
-
La potencia está conectada a la red
-
¿Es un archivo real que no lo toca apache2?
-
Notifique una vez que se complete un trabajo
-
Por qué Pyaudio no está instalando
-
no está en el archivo de sudoers
-
Error tiempo fuera mientras espera Handshake DigitalOcean
-
cómo saber en qué puerto se está ejecutando mi servidor MongoDB
-
¿Por qué Gitlens no funciona en VScode?
-
El analizador de Lcobucci JWT de Target no es instanciable mientras construye pasaporte Laravel
-
No se puede determinar qué versión SDK nativa usa su proyecto porque no está instalado el módulo Expo`. Instálelo con `Yarn Add Expo` e intente nuevamente.
-
Cómo verificar Git y GitHub están conectados correctamente
-
Este sistema no está registrado con un servidor de derechos. Puede usar el administrador de suscripción para registrarse.
-
¿Dónde está el archivo de configuración MPV Linux?
-
MV es un comando UNIX y creo que estás usando Windows. Tiene 2 opciones: instalar Git Bash y en el comando MV de uso BASH. Usando el comando Move Windows.
-
Cómo consultar en una biblioteca si está instalada en conda
-
Apache no está comenzando en XAMPP ubuntu 20
-
Compruebe si el puerto se está ejecutando en Ubuntu
-
¿Cómo sé si está instalada una gema?
-
Cómo saber si Keras está instalado
-
¿Cuál es el comando para abrir un archivo desde emacs?
-
dpkg: paquete de procesamiento de errores gitweb (--configure): paquete gitweb instalado después de instal
-
Error no pudo instalar la aplicación. Asegúrese de tener el entorno de desarrollo de Android configurado
-
Se produjo un error al ejecutar el condensador de subprocesos.
-
Linux Adress ya está en uso
-
Error: ese puerto ya está en uso.
-
Se requiere que otros archivos de clave privados no sean accesibles por otros
-
donde esta zshrc
-
línea de impresión bash si el valor de la columna está en la columna de otro archivo
-
Está ejecutando `Create-react-app` 5.0.0, que está detrás de la última versión (5.0.1). Ya no admitimos la instalación global de la aplicación Create React.
-
Error: Node Sass versión 5.0.0 es incompatible con ^4.0.0.
-
Cómo ver qué tan grande es un archivo Ubuntu Terminal
-
Error al cargar WebView
-
Cómo Grep si la primera letra es un personaje, no un número
-
Error: el hilo no es miembro de STD
-
¿Cuál es mi configuración git?
-
¿Qué proceso está utilizando la memoria Linux?
-
Compruebe de Android si el paquete está instalado
-
Cómo saber qué shell se especifica para Linux
-
La rama actual no tiene un error de rama aguas arriba
-
Error Instalación de DriveSist NPM
-
Linux verifique si el DIR está montado
-
Error de licencia de Android de Flutter Doctor
-
TypeError: Lookups.flatmap no es una función
-
Error después de la desinstalación de Docker
-
Cómo verificar si se está ejecutando un script de Python
-
Compruebe si la variable es un número en Bash
-
Bash verificar si la variable es número
-
¿Dónde está el directorio de inicio de Ubuntu en Windows?
-
nginx parada si proxy_pass está inactivo
-
El parámetro de verificación de bash está configurado
-
Compruebe si el servicio SystemCTL está ejecutando Linux
-
Obtener un paquete en Colab de Github
-
¿Qué se entiende por carcasa de valencia?
-
Falta la herramienta de construcción 32.0.0 RC1 en DX.BAT
-
Bash Verifique si está instalado el paquete Python
-
Error de instalación de PocketSphinx
-
Elifecycle NPM Instalar Error
-
Apto verificar si el paquete está instalado
-
¿Hay alguna diferencia entre Git Push y Git Push Origin Master?
-
Error de actualización de PIP de actualización
-
Bash suprimir el código de error
-
Bash si la variable no está vacía
-
Error de PSYCOPG2
-
`FirebaseAnalytics` requiere la versión de Cocoapods`
-
¿Es malo Linux?
-
Vea qué usuario se ejecuta un proceso como
-
.Gitignore no ignora los directorios
-
Cómo verificar si está instalado ROS
-
Error al cargar bibliotecas compartidas: libx11-xcb.so.1:
-
Bash verificar si el archivo está vacío
-
no se puede cargar porque ejecutar scripts está deshabilitado en este sistema
-
¿Dónde está el archivo de configuración global para git?
-
Es Ubuntu Debian
-
Encuentra lo que se ejecuta en el puerto 8000
-
Error de instalar la cápsula en M1
-
Gradle lanzó un error al descargar artefactos de la red. Vuelva a intentar descargar
-
Geopandas no es instalar
-
sudo se requiere un terminal para leer la contraseña
-
Error de empuje de git
-
¿Qué es el comando de tuberías en Linux?
-
CUDA: Depende: CUDA-11-5 (
-
Error de preparación
-
es lubuntu mejor que ubuntu
-
UTServer: Error mientras carga bibliotecas compartidas: libssl.so.1.0.0: no se puede abrir el archivo de objeto compartido: no hay dicho archivo o directorio
-
La instalación del compositor requiere ext -dom * -
-
./utserver: error al cargar bibliotecas compartidas: libssl.so.1.0.0: no se puede abrir el archivo de objeto compartido: no hay dicho archivo o directorio
-
¿Dónde está la carpeta WSL en Windows?
-
Error: no pudo construir ruedas para backports.zoneinfo, que se requiere para instalar proyectos basados en pyproject.toml
-
Comenzando con cordura
-
requiere pyqt5
-
Lista qué proceso se ejecuta en puerto específico ubuntu
-
Error de instalación de Scikit-Learn
-
SH es nulo si
-
Verifique el servidor MongoDB si se ejecuta localmente
-
Cómo evitar que Ubuntu duerma cuando la tapa está cerrada
-
No hay información de seguimiento para la rama actual.
-
Error PG_CONFIG Ejecutable no encontrado. ubuntu
-
¿Qué es el usuario y el grupo en Linux?
-
¿Qué es el grupo en Linux?
-
Error de borrar registro apache2
-
requiere pyqtwebengine
-
Error de omitir los requisitos de instalación de PIP
-
Apache/2.4.41 (Ubuntu) servidor en el puerto localhost 80 Error
-
Compruebe si un puerto está funcionando
-
Terminal de apertura de error: Xterm-New.
-
¿Cuál es la diferencia entre la instalación de NPM y la instalación de NPM Guardar?
-
¿Qué es el defensor entre apt y apt-get?
-
sudo: el UID efectivo no es 0
-
Cómo eliminar el nombre de archivo Error demasiado largo en Git
-
El puerto 5000 no está abierto en localhost, no puede iniciar funciones emulador
-
Error de archivo eliminado GIT
-
¿Dónde está las imágenes de Docker almacenadas Windows WSL2?
-
Spyder 4.2.5 requiere pyqt5
-
He instalado Android Studio pero no se muestra en Flutter Doctor
-
¿Qué es un paquete Nuget?
-
¿Cuál es mi usuario? Ubuntu
-
Si su sistema está utilizando EFI Secure Boot, es posible que deba firmar los módulos del núcleo (vboxDrv, vboxnetflt, vboxNetAdp, vboxpci) antes de poder cargarlos.
-
¿Cuál es la diferencia entre Git Push Origin y Git Push Origin Master?
-
Error de tiza [err_require_esm]: requirir () del módulo ES
-
mi apache no está ejecutando ubuntu
-
Error no pudo confirmar la transacción (no se pudo recuperar algunos archivos)
-
Se requiere entrada, pero Expo CLI
-
Permiso de error a .git denegado para implementar la clave
-
Los paquetes de destino (main/binary-amd64/paquetes) se configuran varias veces en /etc/apt/sources.list.d/pgdg.list:1 y /etc/apt/sources.list.d/pgdg.list:2
-
El formateador de código más bonito está eliminando;
-
Gem PG Instalar Error Mac OS
-
Cómo verificar si una confirmación está en una rama
-
Error durante la inicialización global MongoDB
-
Cómo descomodar al deshacerse de los cambios
-
Compruebe si una variable es nula en Bash
-
Cómo verificar si se instala MongoDB
-
Unidad Nginx. El servicio está enmascarado
-
Redis :: CommandError: Misconf Redis está configurado para guardar la instantánea de RDB
-
Resolver no se puede instalar un error de dependencia para la instalación de NPM
-
Otro servidor web de Apache se está ejecutando
-
cli mata lo que está escuchando en el puerto
-
Error TS1056
-
Bash verificar si la variable está vacía
-
Error remoto Archivos grandes detectados
-
Xcode No hay suficiente espacio en disco disponible para instalar el producto.
-
Cómo probar si Docker se está ejecutando desde el arranque
-
¿Dónde está el camino en Klai Linux?
-
PowerShell Compruebe si el software está instalado
-
Cómo verificar si su servidor Linux está bajo el ataque DDoS
-
PowerShell Compruebe si el usuario es administrador
-
Etimtout Error al instalar paquetes de nodo en Windows
-
Error de Cypress eNOSPC No queda espacio en el dispositivo Write Docker
-
Linux encuentra dónde está el archivo
-
doc.find no es una función
-
¿Cuál es la diferencia entre PowerShell y el símbolo del sistema?
-
¿Dónde se almacenan los paquetes instalados de PIP en Colab?
-
¿Dónde está instalado Tomcat en Mac?
-
gnutls_handshake () falló: error en la función de extracción
-
Las páginas de Github no son gratis
-
error de libc-bin
-
¿Está corriendo Docker Daemon?
-
Android Studio KVM debe ejecutar este AVD
-
Método ReflectionParameter :: getClass () está en desuso Ubuntu
-
Verifique si está instalado un paquete NPM
-
Algo ya se está ejecutando en el puerto 3000. Probablemente:
-
Verifique el error del archivo .conf Apache
-
Compruebe si el servicio está ejecutando servidor
-
script de shell si la entrada está vacía
-
[Error CRI]: el tiempo de ejecución del contenedor no se ejecuta: salida:
-
que es git
-
CMD Flutter Doctor dice que Android Studio no está instalado
-
¿Qué es samba en Linux?
-
¿Dónde se encuentra mi carpeta Ubuntu?
-
¿Qué es el repositorio local?
-
¿Qué son las credenciales de SSH para Minikube?
-
El formato de recolección Postman V1 ya no es compatible y no se puede importar directamente. Puede convertir su colección en formato V2 e intentar importar nuevamente.
-
Bash If es Link Simbolico
-
Bash si es un enlace simbólico
-
¿Dónde está instalado Ubuntu en Windows 10?
-
Cómo verificar si se instala las herramientas de línea de comandos
-
Prueba si el archivo es bash ejecutable
-
PowerShell suprimir el error
-
GIT GH001: Archivos grandes detectados, eliminar el error
-
Verifique quién inicia sesión en el sistema Linux
-
Cómo verificar si TensorFlow está funcionando en su PC
-
Linux verifica qué aplicación está utilizando la red
-
Docker: el contenedor no se está ejecutando
-
Git Clone La cadena de certificados fue emitida por una autoridad en la que no se confía
-
Se requiere que sus archivos de clave privados no sean accesibles por otros Ubuntu
-
verificar go está instalado Mac
-
Linux verifique si la pantalla se está ejecutando
-
Big Sur Error: Error Instalación de FFI: Error: Error al construir la extensión nativa de GEM.
-
Cómo evitar la aplicación Nginx no encontrada 404 Error Ubuntu React App
-
History Terminal Commad se limita
-
¿Qué servicio es escuchar en qué puerto Linux?
-
Cómo instalar Appium
-
Cómo verificar si Docker está instalado
-
[Error] Se produjo un error al ejecutar el condensador de subprocesos.
-
Cómo verificar si SSH-agent ya se está ejecutando en Bash
-
Si hay una cadena en un lote de archivo
-
Cómo verificar si GIT se inicializa o no
-
Crontab no está ejecutando mi script de shell
-
Error cuando instalo SASS
-
cPtable no se define en make_xlsx
-
Endpoint Security VPN Build 986000724 ya está instalado en esta computadora.
-
Batch Cómo verificar si la carpeta está vacía
-
Si la salida es NULL BASH
-
La aplicación actual no es compatible con NativeScript CLI 8.0.2
-
Gitignore no funciona
-
git ignorar el archivo no funciona
-
Golang Gitignore no funciona
-
Cómo verificar la fecha es anterior a x días en script shell
-
pgadmin4: depende: libpython3.7 (
-
[De -y] no se entiende en combinación con las otras opciones
-
Hay 1 proceso de zombie
-
Cómo verificar si PIP está instalado
-
¿Qué es sudo en Linux?
-
¿Dónde está la carpeta www?
-
Compruebe si Docker Daemon está ejecutando
-
Ubuntu ¿Cuál es mi dirección IP?
-
Bash verificar si el archivo es legible
-
¿Cuál es la opción de ordenar por tamaño de archivo en UNIX?
-
Error de WebView de instalación de PIP
-
Bash continúa con el error
-
rstudio averigüe si el paquete está instalado
-
Error al conectarse al repositorio: Error al realizar el comando git: git ls -remote -h
-
No se puede eliminar C2DD1984ad5b (debe ser forzado): la imagen está siendo utilizada por un contenedor detenido
-
JQuery está registrado como un paquete en NPM. Puede instalar la última versión de jQuery con el comando NPM CLI:
-
Cómo ver (y matar) qué se está ejecutando en su puerto Mac
-
Docker: Respuesta de error de Daemon: Pull Access denegado para
-
Error: Node Sass versión 7.0.1 es incompatible con ^4.0.0.
-
¿Qué es vi en Linux?
-
Pyinstaller no pudo ejecutar el error del script con la opción -Noconsole
-
Error de huellas digitales de Ubuntu
-
Libqt5Core5A no está instalado.
-
Un comando se ejecuta y envía EN correo electrónico cuando se completa en Ubuntu
-
shell script para ingresar un número y verificar el número es un número perfecto o no
-
BASH: ENCUENTRA TODO EL ERROR A LA ANTERIZACIÓN
-
Conda Install lanza el error SSL
-
Instalar Error de almohada Alpine Linux
-
Linux verifique lo que se ejecuta el servidor web
-
Cómo verificar si Tor está instalado
-
Error de clon de Laravel Github
-
El sonido y el video en las tarjetas no funcionarán hasta que se instale MPV o MPlayer
-
Error de OpenSSL con Ruby 2.3.4 en Ubuntu
-
Las áreas de memoria virtual de Elk Max vm.max_map_count [65530] es demasiado bajo
-
rmmod: error: el módulo nvidia_drm está en uso
-
El valor de tipo GDB es más que el tamaño máximo de valor
-
Error de reconstrucción de nodo-gyp Ubuntu 20.04
-
línea de comando si la salida del comando es igual a la cadena
-
El archivo de configuración de Kubernetes es legible
-
El tamaño elegido no es válido para el sistema de archivos elegido. : (-69850)
-
¿Cómo cierro mi ventana virtual que es creada por el comando de pantalla en Linux?
-
No se pudo construir registro de registro Instalación de paquetes recopilados: registro en ejecución de configuración Setup.py para registrar ... Error
-
El archivo de configuración de Kubernetes es legible por grupo
-
Docker-Compose: Error mientras carga bibliotecas compartidas: libz.so.1
-
¿Qué es AppMenu-GTK-Module?
-
Que es GitHub
-
¿Qué es Regedit en Windows?
-
La red virtual no está activa
-
El montaje no es un dispositivo de bloque
-
Error de Windows de NPM
-
Copiar archivos en Docker a Directorio da error
-
Budo no se reconoce como un comando interno o externo
-
Error de instalación de Pycocotools
-
¿Dónde está la carpeta de la oficina?
-
¿Hay algún método para hacer cable shell mongo?
-
Error al instalar el paquete en React 18
-
Ingrese la frase de pass está solicitando contraseña
-
No se puede resolver DNS cuando Kubernetes se está ejecutando en Ubuntu
-
Prueba de bash si la variable es un número
-
Bash verificar si el comando está disponible
-
Se instala la gema de check in Bash en
-
Zoom no está abierto en Ubutnu
-
Error: Falta la configuración del complemento Servidor-Domain: la configuración del complemento.
-
Compruebe si la variable bash no está definida
-
Un nuevo lanzamiento estable de PowerShell está disponible
-
Vea qué grupos hay un usuario en Linux
-
Terminator Linux no está iniciado
-
Docker no pudo inicializar Docker Desktop se está cerrando
-
El tiempo no se actualiza de Internet Ubuntu
-
Cómo verificar si la virtualización está habilitada en BIOS en Manjaro
-
Error de sintaxis de shell script final inesperado del archivo
-
¿Qué es eco en un archivo por lotes?
-
Que es Bash
-
Cómo verificar el agente SSH se está ejecutando en Git Bash
-
Esta es una configuración de GitLab CI para construir el proyecto como una imagen de Docker
-
¿Qué es para Ubuntu Debian o RPM?
-
DOT no se reconoce como un comando interno o externo
-
Instale un paquete que no esté en conda
-
¿Qué es Shell en Linux?
-
No se pudo instalar paquetes debido a un entorno: [WinErerror 5] se niega el acceso
-
No se pudo instalar paquetes debido a un entorno: [WinErerror 5] El acceso se niega:
-
Mensaje de error del sistema Ubuntu
-
¿Qué es la script de shell?
-
Compruebe si Apache New Config se ejecuta CentOS
-
ADVERTENCIA: Tirar sin especificar cómo reconciliar las ramas divergentes se desaconseja
-
que es guthub
-
Installed Build Tools Revision 31.0.0 está dañada. Eliminar e instalar nuevamente con el administrador SDK.
-
¿Qué es Linux?
-
¿Cuál es el uso del comando CAT en Linux?
-
¿Cuál es el uso del archivo BASHRC en Linux?
-
El entorno virtual no se creó con éxito porque AsegurPip no está disponible.
-
¿Qué comando se usa para crear un nuevo repositorio de git?
-
¿Qué es el repositorio remoto?
-
Error de Android/Gradlew Eacces
-
Verifique que el control remoto se agregue correctamente
-
quien se ve afectado por la meningitis
-
FATAL: No se puede acceder a acceder a la configuración del error Certificado Verificar ubicaciones CA-Bundle.CRT Capath: Ninguno
-
¿Qué es Amplify CLI?
-
Error de Windows de fibras npm
-
Cómo verificar una ruta es archivo o director en shell script
-
Cómo verificar si está instalado CyberDuck
-
¿Hay un repositorio de vapor para Kali Linux?
-
Cómo mostrar qué versión de Kerne está intallada en el sistema Linux
-
Se encontraron enlaces simbólicos rotos es esto un problema
-
Error de comando desconocido de aumento
-
error nginx dompdf
-
¿Qué es un repositorio?
-
Cómo Kali Pentest Guide Line Command Cómo hackear con Kali Humm My Friendsss está de vuelta en Google Make A Signe
-
Gthumb es un espectador de imágenes realmente agradable con herramientas de edición básicas para Ubuntu
-
Verifique el anillo si el sistema operativo es UNIX o no
-
Evite este mensaje: la nueva contraseña es solo una versión envuelta de la antigua (y algunos otros mensajes similares)
-
Su navegador u sistema operativo ya no es compatible. Es posible que deba instalar las últimas actualizaciones en su sistema operativo.
-
Actualizar el compositor en Mac para resolver el error de verificación SSL
-
MacOS verifica si el archivo es binario
-
Error al cargar WebView vscode ubuntu
-
Git Repositorio inseguro es propiedad de otra persona
-
Error de instalación de MySQL2 Ruby
-
El archivo de registro de Laravel está fuera de GIT
-
Git Rebase, que es local y remoto
-
Mantener vivo el servidor web cuando el terminal está apagado
-
El error de Splunk no puede crear prueba
-
NPM Instalar SASS-Loader Error
-
Verifique el anillo si el sistema operativo es Linux o no
-
rescindir cualquier proceso que esté utilizando el número de puerto para comunicarse
-
Error de Fedora al cargar bibliotecas compartidas: libgconf-2.s.4: No se puede abrir el archivo de objeto compartido: no hay dicho archivo o directorio
-
OIP Freeze no está utilizando requisitos EnvIn.
-
¿Qué edad tiene Nezuko?
-
Cambiar el navegador predeterminado no funciona en Manjaro
-
El aire no es un comando
-
Ejecutando la instalación de Setup.py para PyahocorAsick ... Error
-
Mac mira lo que está ruidando en un puerto
-
Error: la cuenta no es un programa actualizable o ya está en uso
-
¿Dónde está la veterano Linux?
-
PASSWD PASSACIÓN PARA AIBOTUSER No ha cambiado Docker
-
No se pudo guardar la autenticación de dos factores: el módulo Perl Authen :: Oath necesario para la autenticación de dos factores no está instalada. Use la página de módulos Perl en Webmin para instalarla.
-
¿Está instalado Greepper?
-
Intentando registrar Bundler :: GemFileError para el código de estado 4 Pero Bundler :: GemFileError ya está registrado
-
Corrige el error SSH en la terminal
-
La huella digital para la tecla RSA enviada por el host remoto es
-
PS1 no se puede cargar porque ejecutar scripts está deshabilitado en este sistema. Para obtener más información, consulte Acerca de_Execution_Policies en
-
Ubuntu 20.04 Dash está en conflicto con el muelle
-
¿Qué es Bash OS?
-
Qué repositorio se hace cuando Expo init
-
Compruebe si mi conexión es wpa2 ubuntu
-
es mi sistema de 64 o 32 bit Linmux
-
Cómo verificar si se instala Helm
-
La base de datos está siendo accedida por otros usuarios
-
La revisión de herramientas de compilación instaladas 32.0.0 está dañada. Eliminar e instalar nuevamente usando el SDK Manager
-
¿Qué es?-Save-Dev Compruebe cuando instalamos un Pachage
-
Ubuntu 19.10 Error de actualización de EOAN
-
Redirección de salida y error en Linux
-
PIP Instale Error PSYCOPG2
-
STD Error Bash
-
val si $ foo está configurado (y no nulo)
-
Compruebe si Internet está disponible Script Shell Script
-
La CPU está atascada durante 30 segundos en Ubuntu
-
Si los datos no están disponibles, el encabezado de la columna debe imprimir en el archivo de salida en PowerShell
-
Se requiere CMake 3.16.0 o superior. Estás ejecutando la versión 3.10.2
-
Después de instalar Cypress, hay un directorio de Cypress
-
Comando de error del escáner de mapache no encontrado
-
Una transmisión de audio o video no se maneja debido a la falta de códec
-
Facebook Signin no funciona en la aplicación FacBook solo funciona cuando no se instala ninguna aplicación
-
Contiene el problema de GlobalProtect y pre-dependencia: GlobalProtect Prevess-depende en LibQT5Webkit5 Libqt5Webkit5 no está instalado.
-
El error de rama de eliminación de git no se encuentra
-
Error de Letsencrypt
-
¿Qué son las pruebas de instalación?
-
MSSQL-Tools: Depende: MSODBCSQL17 (
-
no abrir en cucarachdb
-
Redirigir archivos de error a diferentes archivos Linux
-
Compruebe si el contenedor es privilegiado
-
def_daemon [19685]: Segfault en 7F4D6811B7F0 IP 00007F4D6811B7F0 SP 00007F4D65BCC808 Error 15
-
ajustar barras de error de gnuplot
-
Qué hacer si Linux no responde
-
Error de dominio Letsencrypt
-
VScode se está desmayando en WSL
-
Error de Ubuntu SSL No ha elegido confiar en la autoridad de certificación de conflicto - G2
-
Cómo corregir el error no puede cambiar el directorio de trabajo
-
Obtengo que tu rama está por delante de Master después de sacar de Remote Master
-
GitHub de repente da un error de archivo grande
-
La cadena vacía Git FTP no es una PathSpec válida. por favor use . en su lugar, si quise hacer coincidir con todos los caminos
-
El valor de verificación es el número en CMD
-
¿Cuál es el código de murciélago de la impresión Hello World?
-
¿Cuál es la diferencia entre la desinstalación de NPM y eliminar
-
está fuera del repositorio en
-
WTMP no es legible
-
¿Cuál es el comando para crear una imagen de Dockerfile y Podman?
-
Cómo verificar Linux es Ubuntu o Centos
-
¿Cuál es la ID de inicio de sesión en masilla para Ubuntu?
-
Error de Crontab a NULL
-
NodeJs nueva versión error sobrescribir antigua
-
Error de PIP install Pywhatkit
-
¿Dónde está la variable Jenkins_Home en Bunutu?
-
Escape no se muestra en el panel superior de Mac
-
Cómo verificar la variable de entrada es una cadena o número en shell
-
svelte que se inicia tipicamentos
-
Obtener ayuda para Git
-
vscode .ps1 no está firmado digitalmente
-
Error: para build_env no puede crear contenedor para el servicio build_env: create.: El nombre del volumen es demasiado corto, los nombres deben ser al menos dos caracteres alfanuméricos
-
Se busca la agencia legítima
-
Docker Gnupg, Gnupg2 y Gnupg1 no parecen estar instalados, pero se requiere uno de ellos para esta operación
-
Lo que se establece en Ubuntu
-
Lo que se ejecuta en TCP4 0.0.0.0:5432 para verificar en el terminal
-
Cómo forzar instalar un paquete incluso es instalar Pip
-
¿Dónde está Zshrc en Big Sur?
-
No hay una aplicación instalada para archivos de biblioteca compartida
-
ver lo que es a través de un archivo
-
Cómo saber si mi Linux es Debian o Fedora
-
Compruebe qué guión de Python está ejecutando
-
¿Es UNIX un sistema operativo de código abierto?
-
Nuxt cheque es producción
-
Error de comando de cp bash con paréntesis
-
Cómo seleccionar un objeto basado en un campo que es como una cadena JQ
-
¿Qué es el editor nano en Linux?
-
El proceso no puede acceder al archivo porque está siendo utilizado por otro proceso. Pulse cualquier tecla para continuar...
-
msbuild no se reconoce como el nombre de un cmdlet
-
Cómo verificar la aplicación está instalada o no Unity
-
¿Hay alguna forma de guardar las contraseñas de forma segura de GitHub en Linux Git?
-
El código de archivo por lotes detecta si la carpeta está vacía o no
-
el monte es fstab
-
¿Qué es TMUX adjuntar Windows?
-
es necesario ejecutar `file_system` para su sistema
-
Webmin depende de Unzip; Sin embargo: el paquete Unzip no está instalado.
-
dpkg: paquete de procesamiento de errores nginx (--configure): problemas de dependencia-dejando no configurado
-
Cómo saber si está algo para tirar
-
PowerShell Compruebe si el niño es directorio
-
¿Qué es lo diferente de Git y Github?
-
Refname Master es ambiguo
-
¿Qué es Force Refight en Git?
-
Seleccione un objeto basado en un campo que es como una cadena JQ
-
Error VIM en Ubuntu
-
shell es posible combinar la búsqueda de variables bash y reemplazar con la subcadena
-
Windows muestra tiempo incorrecto cuando cambio de Ubuntu
-
Git Agregar nuevamente al seguimiento que se elimina el archivo del seguimiento sin eliminar
-
Pathspec fatal está en submódulo
-
La versión de actualización de APT no está firmada
-
Ibus-Demon no se está ejecutando
-
registro de errores de crontab
-
SDepends: libgcc-s1 (
-
¿Qué es el núcleo y el caparazón?
-
Compruebe si Cmake está instalado Windows
-
¿Qué puedo hacer con el error que no puedo emitir certificado clon git?
-
Ubuntu reiniciar el administrador de la red cuando el ping es bajo
-
Se produjo un error al instalar Capybara-Webkit (1.15.1), y Bundler no puede continuar.
-
Script de paquete libc-bin instalado subprocesamiento devuelto Error Error Estado de salida 134
-
es un comando para crear una cuenta de usuario llamada Serena, incluido un directorio de inicio y una descripción.
-
React Material-UI Instalar error en React 18
-
¿Qué es un directorio de nivel superior?
-
Laravel Mix no ha referenceError: Babelhelpers no está definido
-
están tratando de instalar Ruby-2.7.0 en Heroku-20. remoto: ! remoto: ! Ruby Ruby-2.7.0 está presente en las siguientes pilas: Remoto :! remoto: ! - Heroku-18
-
¡Llamar a la descarga no comprobada del archivo de fórmula de PUP de una URL arbitraria está deshabilitado!
-
Debido a que nunca puede anticipar en qué entorno se lanzará su ZSH en particular, es una buena práctica restablecer las opciones al comienzo de su script con el comando emular:
-
La opción de Git Bash no viene
-
ssh_askpass: posix_spawnp: error desconocido
-
¿Qué son los requisitos vagabundos y del sistema?
-
Heroku config: set npm_config_production = false yarn_production = falso error
-
Ejemplo de archivo de archivo YAML Error de Ubuntu NetPlan
-
Git Pull está por delante de X Commit
-
Los metadatos GVFS no son compatibles. Fallback a Teplmetadatamanager.
-
Error mientras gobierna más bonito
-
Ubuntu Anydesk: Error al cargar bibliotecas compartidas: libpangox-1.0.so.0: no se puede abrir el archivo de objeto compartido: no hay dicho archivo o directorio
-
R PAQUETES DE INSTALACIÓN Error de exportación al cliente
-
Mac Workbench Error de carga de contenido de esquema 1558
-
Salida de script de Ubuntu Bash cuando Error
-
AnyDesk: Error al cargar bibliotecas compartidas: libpangox-1.0.so.0: no se puede abrir el archivo de objeto compartido: no hay dicho archivo o directorio
-
Corrige el error de red Docker y los contenedores de Windows
-
Git Ignore no funciona en el repositorio local
-
Git Rebase no funciona
-
Error de permiso de eacces denegado mkdir xampp ubuntu
-
cuantos PPI son 4K
-
El dispositivo de entrada de Docker no es un TTY
-
C# Verifique si se instala Word
-
RSYSLOGD Verificar el servicio se ejecuta
-
PY PIP Instale Error WinError El sistema no puede encontrar el .exe.deleteme
-
cómo reslove el software JIRA tiene licencia pero actualmente no está instalado
-
libthai0: i386 depende de libdatrie1 (
-
¿Qué es GREPCC?
-
syslog-ng [31899]: Mensaje de registro de procesamiento de errores:
-
Estado de salida de error de subproceso previo a la resolución de retroceso 127
-
Eliminar el error de GPG en su aplicación o paquete instalado
-
Solidus comenzando
-
Necesitamos generar muchos bytes aleatorios. Es una buena idea realizar alguna otra acción
-
Bash verificación de retorno del comando no error
-
El dispositivo Umount está ocupado
-
no es un error fatal de repositorio de git
-
Permiso de error digital Ocear denegado (PublicKey).
-
Error: Error Instalación de Jekyll: Error: Error al construir Gem Native
-
Error: RPC falló; Curl 56 Gnutls Recv Error (-110): la conexión TLS se terminó de manera no cerrada.
-
El trabajo para redis-server.service falló porque el proceso de control salió con el código de error.
-
Error Instalado React Native usando NPX React Native Init
-
shell cehck si la cadena es nula
-
Cómo hacer ping y saber si el objetivo está vivo Kali Linux
-
Falta el componente Flutter CMDLine-Tools
-
¿Por qué necesito subir mi contraseña 3 veces git?
-
libqtgui4: depende: libpng12-0 (
-
Error al instalar dkphotogallery en xcode
-
Falta Rolyn después de recuperar el control de la fuente
-
NG Servir --- MG: Error fundamental del servidor
-
anterior.
-
Hyper-V mobylinuxvm primario ubuntu ¿Cuál es el inicio de sesión?
-
Explore las respuestas de código populares por idioma
Explorar otros lenguajes de código