“Información de nivel de registro de Regex o advertir o ERRO” Código de respuesta
Respuestas similares a “Información de nivel de registro de Regex o advertir o ERRO”
Preguntas similares a “Información de nivel de registro de Regex o advertir o ERRO”
Más respuestas relacionadas con “Información de nivel de registro de Regex o advertir o ERRO” en Shell/Bash
-
Error: debe instalar al menos un PostgreSQL-Client-
-
Error Gyp err! Error de pila: no encontrado: hacer
-
¡Gyp Err! Error de pila: no encontrado: hacer
-
Advertencia: Actualización de Heroku disponible de 7.47.4 a 7.47.5
-
Error Daemon de arranque: error al abrir la base de datos de metadatos del almacén de volumen: tiempo de espera
-
Compruebe si Heroku CLI está conectado
-
Borrar registros de NPM
-
Mostrar registros de Nginx
-
Tail nginx registros
-
Error de Mac que el puerto ya está en uso
-
Error: uvicorn.Error: [ERRNO 98] Dirección ya en uso
-
modulenotfoundError tqdm
-
No se pudo instalar paquetes debido a un OSError: [WinErerror 5] El acceso se niega:
-
Error de sintaxis: typeError: this.getOptions no es una función
-
Error a instalar Pyodbc Linux
-
Error de sintaxis de Vuejs Sass: typeError: this.getOptions no es una función
-
NPM Install--No-Audit --Save --Save-Exact--Loglevel Error React React-Dom React-Scripts CRA-Template ha fallado.
-
Falló en el [email protected] Postinstall Script. NPM ERR! Probablemente esto no sea un problema con NPM. Es probable que haya una salida de registro adicional arriba.
-
Verifique el registro en el usuario Git Shell
-
Error de fijación de PowerShell
-
-
-
-
-
Proceso de control de Nginx salido con el código de error
-
Error PIP instalar PSYCOPG2 -Binary LD: Biblioteca no encontrada para -lssl
-
ADVERTENCIA: OS-ProBer no se ejecutará para detectar otras particiones de arranque. Los sistemas en ellos no se agregarán a la configuración de arranque de grub.
-
Instalación de inicio de sesión de frasco
-
FirebaseCommandException: se produjo un error en la CLI de Firebase al intentar ejecutar un comando.
-
Registros de cola Docker
-
Registros de contenedores Docker de cola
-
Error: debe resolver su índice actual First Git
-
Git fusionar errores
-
NotisplementedError: las teclas OpenSSH solo admitidas si ED25519 está disponible Net-SSH requiere las siguientes gemas para el SUPOR ED25519
-
Error: faltando bandera requerida: -a, la aplicación de la aplicación -App para ejecutar el comando contra ver más ayuda con --help
-
Ubuntu Rootic Login SSH
-
El error de git necesita fusionar
-
NPM Instale el error de mangosto NPM err! código enoself
-
Error: Node Sass aún no admite su entorno actual
-
Fallado de compilación del módulo: Error: Node Sass aún no admite su entorno actual: OS X de 64 bits con tiempo de ejecución no compatible (79)
-
Error: Node Sass aún no admite su entorno actual: Windows de 64 bits con tiempo de ejecución no compatible
-
Buscar un compromiso en los registros de Git
-
ADB Logcat Unity
-
Unity Logcat
-
Error al instalar PSYCOPG2 en Ubuntu 20.04
-
Excepción: Error en ejecutar la instalación de Pod POD
-
Falló el comando: instalación de npm-error-logelvel --legacy-peer-deps
-
XCRUN: Error: ruta de desarrollador activo inválido (/biblioteca/desarrollador/commandlineTools), falta xcrun en:/biblioteca/desarrollador/commandlineTools/usr/bin/xcrun
-
Iniciar sesión sin contraseña está prohibido por la configuración (consulte ALOWNOPASSWORD) Ubuntu
-
Error de empuje de duing: RPC falló; Transferencia de curl 18 cerrada con datos de lectura sobresalientes restantes de envío: desconexión inesperada mientras lee el paquete de banda lateral
-
OSError: [Errno 24] El límite de instancia de inotify alcanzado
-
matar logstash
-
No se puede resolver el error del árbol de dependencia al instalar paquetes NPM
-
El trabajo para apache2.service falló porque el proceso de control salió con el código de error.
-
Error: no se pudo construir ruedas para Numpy que usan PEP 517 y no se pueden instalar directamente
-
Error de instalación de nodo SASS
-
Git busque inicio de sesión
-
El recuento de columnas de mysql.proc es incorrecto. Esperado 21, encontrado 20. Creado con MariadB 100145, ahora ejecutando 100415. Utilice mysql_upgrade para corregir este error
-
Error de Heroku: SRC RefSpec Master no coincide con ninguno.
-
PIP instalar PSYCOPG2 Error Fedora
-
Error de inicio de usuarios proxy: escuche TCP4 0.0.0.0:8080: Bind: Dirección ya en uso
-
Crontab Logs CentOS
-
Error de GYP NPM Instalar
-
Desactivar el inicio de sesión de contraseña ssh
-
Heroku Cli Iniciar sesión
-
wget ignore el error de certificado SSL
-
GRP Docker Registros
-
Error de compilación de sombreadores de flutter skia
-
Error de compilación del sombreador de errores de flutador
-
Error de compilación de Shader de Chrome Skia
-
Error no pudo iniciar el titiritero del proceso del navegador
-
Error: ENOSPC: Límite del sistema para el número de observadores de archivos alcanzados
-
Advertencia en instalación. Packages: Instalación del paquete Tidyverse tenía un estado de salida no cero
-
clúster-info
-
GIT Iniciar sesión
-
No se puede iniciar el servicio SSH-Agent, Error: 1058
-
remotelog muiry03 github
-
Línea de comandos GIT Ver registro
-
Linux Último inicio de sesión
-
BrowsRerouter React no funciona Instalar
-
react js browserrouter npm
-
Error de montaje de dev SDB1 en Media en Ubuntu
-
No se pudo encontrar el controlador (SQL: Seleccione * de Information_Schema.Table
-
Linux Get Docker Compose Logs
-
Uso: hilo [opciones] hilo: error: no hay tal opción: -template
-
Bypass Login Jupyter Ubuntu
-
ruta no válida de error git
-
Error: no se pudo impulsar algunas referencias a
-
GPG: Advertencia: permisos inseguros en Homedir
-
Error: SRC RefSpec Master no coincide con ninguno. git
-
Cómo iniciar sesión en GIT desde Terminal
-
Iniciar sesión Github Line de comandos
-
No se pudo descargar la información del repositorio ubuntu
-
Oh mi ZSH XCRUN: Error: ruta de desarrollador activo no válido
-
Obtener información adicional sobre un repositorio remoto en el comando git
-
Connection falló en blueman.bluez.errors.dbusfailederror Protocolo no disponible
-
UserWarning: Matplotlib está utilizando actualmente AGG, que es un backend no GUI, por lo que no puede mostrar la figura. plt.show ()
-
Registros de Heroku
-
Error: GPG Check falló Fedora MySQL
-
Conductor Error de modo de interfaz de usuario del conductor San Francisco
-
Cómo cerrar la sesión de GIT en la terminal
-
INSCARGAR DE GIT CLI
-
CRT no asegura advertencias
-
Flutter Linux Cmake Error
-
ImporterRor: no se puede importar el nombre Docevents
-
PSSYCOPG2 ERROR INSTALACIÓN
-
Verifique la memoria toda la información
-
CondavalueError: el prefijo objetivo es el prefijo base. Aborto.
-
La instalación de PIP falla con el error de conexión SSL
-
Apache Airflow Inicie sesión predeterminado
-
Heroku Logs CMD
-
Eliminar los registros de Docker Linux
-
python pandas read_excel xlrderror Excel XLSX Archivo no es compatible
-
Error de git: más de un valor para el usuario clave. Nombre:
-
Pipenv se produjo un error al instalar PSYCOPG2 == 2.8.4
-
Pipenv un error PSYCOPG2
-
SEGURAR COMANDO DE REPOSITORIO ADPT-APT No se encuentra Error en Ubuntu y Debian
-
Force Logrotate Linux
-
no se pudo instalar paquetes debido a un Oserror
-
Flutter Doctor-Error de licencias de Android
-
Licencia de Flutter noclassDefFoundError
-
Flutter Doctor-Error de Java de liquidaciones de Android
-
Flutter Doctor Android Licencias de licencia en Thread Main Java.lang.NoclassDefFoundError
-
Error de nodo-gipo en Windows 10
-
Error de nodo-ging
-
Mac Anydesk comienza a iniciar sesión
-
Bash Loggin como root
-
Firebase Iniciar sesión sin local
-
Clear Ubuntu Logs
-
No hay información de seguimiento para la rama actual. Especifique con qué rama desea fusionarse. Ver Git-Pull (1) para más detalles.
-
Error: la extracción no es posible porque tiene archivos inalteres.
-
Error: Node Sass aún no admite su entorno actual: Linux de 64 bits con tiempo de ejecución no compatible (83)
-
No se pudo instalar paquetes debido a un entorno, [WinError 32] El proceso no puede acceder al archivo porque está siendo utilizado por otro proceso
-
Iniciar sesión Git en la terminal
-
PIP instale el error de django-heroku
-
registros de contenedores Docker Clear
-
Error: no se encuentran referencias remotas similares a Flathub
-
Proceso de usuario ejecutivo causado: error de formato ejecutivo
-
Error: RPC falló; Curl 28 OpenSSL ssl_read: la conexión se restableció, Errno 10054 Send-Pack: Desconexión inesperada mientras lee el paquete de banda lateral fatal: el extremo remoto colgó inesperadamente todo lo actualizado
-
tronos cron
-
Error Instalar Cocoapods
-
Error de PSYCOPG2 Error de instalación de PIP
-
Error: paquete android.support.v4.content no existe condensador iónico
-
Error: paquete android.support.v4.content no exis
-
El comando de error falló con el código de salida 3221225477
-
Fuente VSCode para Terminal Linux PowerLevel10k
-
Mac M1 Error ejecutando la instalación de Pod
-
Huellas dactilares de inicio de sesión deshabilitado Ubuntu 20.04
-
Proporcione un error de ruta de caché válido
-
Error fatal en el lanzador:
-
Ver registros de PM2
-
Prolog como correr
-
Error: ¡la biblioteca PCAP no se encuentra!
-
Git CLI Iniciar sesión
-
Excepción: Error de ejecutar la instalación de Pod Flutter en IOD
-
Kubernetes combina registros todas las réplicas
-
Error durante la conexión: en la configuración de demonio predeterminada en Windows, el cliente Docker debe ejecutarse con privilegios elevados para conectarse.
-
El origen remoto ya existe un error
-
Error: RPC falló; Curl 56 Libressl SSL_read: Restablecimiento de conexión por Peer, Errno 54
-
Errores bash: error de sintaxis - ambiguo - archivo
-
Firefox Ocultar contraseña Advertencia
-
Comando de instalación de PolyBlog
-
Ubuntu 20.04 powerLevel10 vs código
-
Recibí un error creando la base de datos de prueba: Erreur: Droit Refus Pour Crer Une Base de Donnes
-
Importador: LXML no encontrado, instálelo
-
Error tiempo fuera mientras espera Handshake DigitalOcean
-
Ubuntu renombra el inicio de sesión del usuario
-
Error: PostCSS Plugin TailWindcss requiere PostCSS 8.
-
Git Línea de comandos de inicio de sesión ubuntu
-
truncate docker troncos
-
Este error puede indicar que el Docker Daemon no se está ejecutando
-
Tail access_log
-
Node JS Nodemailer Error: inicio de sesión no válido: 535-5.7.8 Nombre de usuario y contraseña no aceptados.
-
Ubuntu Últimos registros
-
JournalCtl Clear Logs
-
INGOMPARIO DE SAML2AWS
-
OpenSSL ssl_connect: ssl_error_syscall en relación con github.com:443
-
Ubuntu INGOGAR
-
Inicie sesión en el entorno virtual en Mac
-
Docker Eliminar registros
-
dpkg: paquete de procesamiento de errores gitweb (--configure): paquete gitweb instalado después de instal
-
Error no pudo instalar la aplicación. Asegúrese de tener el entorno de desarrollo de Android configurado
-
Instale ZSH con el complemento de personalización PowerLevel10k
-
Error: no pudo encontrar una versión que satisfaga el requisito CV2 (de las versiones: ninguna)
-
Docker limpia registros
-
Se produjo un error al ejecutar el condensador de subprocesos.
-
Error de Git: [email protected]: permiso denegado (PublicKey). FATAL: No se pudo leer del repositorio remoto. Asegúrese de tener los derechos de acceso correctos y el repositorio existe.
-
Inicie sesión en Azure CLI utilizando el principal de servicio
-
Error: ese puerto ya está en uso.
-
Ubuntu de reconocimiento facial Iniciar sesión
-
Servidor: Error: recibí el permiso al negar mientras intenta conectarse al Socket Docker Daemon
-
phoneinfoga github
-
Error: mientras ejecuta GEM ... (GEM :: FilePermissionError)
-
React Native Git Error: SRC RefSpec Main no coincide
-
Error: SRC RefSpec Master no coincide con ningún error: no pudo empujar algunas referencias a Android Studio
-
Error: Node Sass versión 5.0.0 es incompatible con ^4.0.0.
-
Error: no se pudo impulsar algunas actualizaciones de Refs fueron rechazadas porque el control remoto contiene trabajo que no tiene localmente
-
Error: los siguientes directorios no son escritos por su usuario:/usr/local/lib/pkgconfig
-
Error de carga WebView: Error: no se pudo registrar los trabajadores del servicio: InvalidStateError: No se pudo registrar un trabajador del servicio: el documento está en un estado no válido
-
Error al cargar WebView
-
Error: el hilo no es miembro de STD
-
Root Kali Iniciar sesión
-
La rama actual no tiene un error de rama aguas arriba
-
Error Instalación de DriveSist NPM
-
Error de licencia de Android de Flutter Doctor
-
TypeError: Lookups.flatmap no es una función
-
Error después de la desinstalación de Docker
-
Error: permiso insuficiente para agregar un objeto a la base de datos del repositorio .git/objetos
-
Git Reflog
-
Error de instalación de PocketSphinx
-
Elifecycle NPM Instalar Error
-
deshabilitar las teclas de inicio de sesión de SSH solo
-
Desactivar contraseña SSH Iniciar sesión
-
Git Push Pull solicita iniciar sesión cada vez
-
Ubuntu Iniciar sesión como root
-
Error de actualización de PIP de actualización
-
Bash suprimir el código de error
-
Error: el archivo .ini no incluye la sección SupervisorCTL
-
Error: Escuchar Eaddrinuse: Dirección ya en uso ::: 9000
-
Registros de inicio de sesión de Ubuntu Server
-
Cómo iniciar sesión Github en la terminal
-
Error de PSYCOPG2
-
GH inicio de sesión
-
Linux Iniciar sesión en GitHub a través de Git
-
Logotipo de Arch Linux
-
logotipo de Charcode Arch Linux
-
Git Eliminar Error de rama remota: no se puede eliminar la referencia remota no existe
-
Error de CMake: ¡No pude encontrar cmake_root!
-
CommandNotFoundError: su shell no ha sido correctamente
-
Se encontraron errores mientras se procesaron: libglx-mesa0: AMD64
-
Caché de sus credenciales de inicio de sesión
-
caché de sus credenciales de inicio de sesión en el comando git
-
Error: los siguientes archivos de árbol de trabajo no seguidos se sobrescribirían por Merge:
-
Error al cargar bibliotecas compartidas: libx11-xcb.so.1:
-
_csv.error: la línea contiene byte nulo
-
Error de instalar la cápsula en M1
-
Gradle lanzó un error al descargar artefactos de la red. Vuelva a intentar descargar
-
Error de empuje de git
-
Error de preparación
-
Heroku ver todos los registros
-
Inicie sesión en SSH con contraseña
-
Error: ENOSPC: Límite del sistema para el número de observadores de archivos alcanzados,
-
Error de NPM: EACCES: Permiso denegado, Scandir
-
Error: eacces: permiso denegado, mkdtemp linux ubuntu
-
Error: no pudo construir ruedas para backports.zoneinfo, que se requiere para instalar proyectos basados en pyproject.toml
-
Error: RPC falló; transferencia de curl 18 cerrada con datos de lectura sobresalientes que permanecen fatales: el extremo remoto colgó inesperadamente
-
git cambia token personal para iniciar sesión y pases
-
Obtener la versión Logstash
-
Error de instalación de Scikit-Learn
-
Kubectl obtiene registros de implementación
-
No hay información de seguimiento para la rama actual.
-
Error PG_CONFIG Ejecutable no encontrado. ubuntu
-
Inicie sesión en GitHub VScode usando tokens de acceso personal
-
Cómo ejecutar archivos Verilog en Linux
-
PIP Instalar ignore errores
-
Error de omitir los requisitos de instalación de PIP
-
Apache/2.4.41 (Ubuntu) servidor en el puerto localhost 80 Error
-
Error: no pudo encontrar una versión que satisfaga el matraz de requisito (de las versiones: ninguno) Error: no se encontró distribución coincidente para el frasco
-
Terminal de apertura de error: Xterm-New.
-
Ver JournalCtl en ejecución de registros
-
Eliminar registros de más de 7 días Linux
-
Error de UVicorn: [ERRNO 98] Dirección ya en uso
-
Cómo eliminar el nombre de archivo Error demasiado largo en Git
-
Error de archivo eliminado GIT
-
Error: escuchar eaddrinuse: dirección ya en uso
-
Error: SRC RefSpec Master no coincide con ninguno.
-
colorlog python
-
Python de registro de color
-
Error de tiza [err_require_esm]: requirir () del módulo ES
-
Redux Logger
-
Error no pudo confirmar la transacción (no se pudo recuperar algunos archivos)
-
Cómo mostrar el logotipo de Ubuntu en la terminal
-
hw para iniciar sesión en git
-
Iniciar sesión en la terminal de Github
-
Permiso de error a .git denegado para implementar la clave
-
Error: paquete android.support.annotation no existe
-
Ubuntu Loggin de raíz persistente
-
*** ADVERTENCIA: derivación de clave desaprobada utilizada
-
Los errores de show de vScode Prettier
-
Error: no hay escenarios; Debe tener al menos uno.
-
Importor: ningún módulo llamado Alsaudio
-
Gem PG Instalar Error Mac OS
-
Error: no ha concluido su fusión (existe merge_head).
-
Importor: ningún módulo llamado TensorFlow
-
Docker Exec Regs
-
Docker Regists Últimos 10 líneas
-
Error durante la inicialización global MongoDB
-
ruta de registros de Docker-Compose
-
Docker Logs Path Var Registros
-
Advertencia: LF será reemplazado por CRLF
-
Advertencia: APT no tiene una interfaz CLI estable. Úselo con precaución en los scripts.
-
Error: permisos insuficientes para el dispositivo
-
diálogo más Android Github
-
Cómo borrar los registros de Docker-Compose
-
rotación de la fuerza de logrotato
-
Redis :: CommandError: Misconf Redis está configurado para guardar la instantánea de RDB
-
i-got-de-orror-when-i-intstin-composer-league-flystemsystem-aws-s3-v3
-
Resolver no se puede instalar un error de dependencia para la instalación de NPM
-
Err_NO_Certificates: Error ADB encontrado: noCertificates. iónico
-
Error TS1056
-
Error remoto Archivos grandes detectados
-
npm typeError [err_invalid_arg_type]:
-
nodo js typeError [ERR_INVALID_ARG_TYPE]: el argumento debe ser de Type String. Recibido indefinido
-
rieles abortados! TypeError: desajuste de superclase para comando de clase
-
WslregisterDistribution falló con error: 0x8000000d
-
Error: el comando falló: adb shell am start -n
-
Pymongo.errors.ServerselectionTimeOuterror: Localhost: 27017
-
Error de Vscode: Eacces: permiso denegado
-
Etimtout Error al instalar paquetes de nodo en Windows
-
Error: SRC RefSpec Main no coincide con ningún error: no se pudo impulsar algunas referencias a
-
Error de Cypress eNOSPC No queda espacio en el dispositivo Write Docker
-
sudo apt-get ignora la advertencia
-
sudo apt-get ignora errores
-
Encuentra registros en las vainas de Kubernetes
-
gnutls_handshake () falló: error en la función de extracción
-
Cómo cerrar sesión desde Github Desktop
-
Error: SRC RefSpec Develop no coincide con ninguna
-
Error fatal en el lanzador: no se puede crear el proceso utilizando este error al instalar PIP
-
Se encontraron errores de Ubuntu mientras procesaban libc-bin
-
error de libc-bin
-
Push de la línea de comando de inicio de sesión de Docker
-
Verifique el error del archivo .conf Apache
-
Advertencia Archivo de clave privada sin protección EC2
-
Error de uso: el directorio de paquetes más cercano
-
[Error CRI]: el tiempo de ejecución del contenedor no se ejecuta: salida:
-
reinicio de refleg de git
-
Error: No se puede encontrar una coincidencia: Ansible
-
AZ Login ACR -N
-
Comando git para cambiar la información del autor solo para la próxima confirmación
-
Agregar fecha para git reflog
-
Error: SRC Refspec Master no coincide con ningún Heroku
-
Git Push Heroku Master Error: SRC Refspec Master no coincide con ninguna
-
Reading State Information ... Hecho E: No se puede localizar el paquete Docker-CE
-
) de exc ^ syntaxError: sintaxis no válida Mac
-
Error fatal: compactos de marca ineficaces cerca de la asignación del límite del montón Fallido - JavaScript CoNT Out Memory
-
Usuario sin centos de inicio de sesión
-
Iniciar Logstash
-
PowerShell suprimir el error
-
GIT GH001: Archivos grandes detectados, eliminar el error
-
Verifique quién inicia sesión en el sistema Linux
-
xcrun: error: ruta de desarrollador activo no válido
-
SSH Iniciar sesión
-
Necesita un error de fusión: debe resolver su índice actual primero
-
Big Sur Error: Error Instalación de FFI: Error: Error al construir la extensión nativa de GEM.
-
phpinfo cli
-
Gitlab Iniciar sesión en la terminal
-
Cómo evitar la aplicación Nginx no encontrada 404 Error Ubuntu React App
-
Requisitos de instalación de PIP.txt ignora los errores
-
[Error] Se produjo un error al ejecutar el condensador de subprocesos.
-
Genere la tecla SHA1 para el inicio de sesión de Facebook Android
-
Linux envía un mensaje syslog al servidor remoto
-
NPM Iniciar sesión
-
Comando Docker para iniciar sesión con el nombre de usuario y pasar la palabra
-
Registros de mudanzas Undiding
-
Configurar: Error:-With-Openssl se dio pero OpenSSL no se pudo detectar
-
La identificación del compilador CUDA es un error de cmake desconocido en cmakelists.txt: 441 (enable_language): no se pudo encontrar CMAKE_CUDA_COMPILER.
-
Cómo Docker Iniciar sesión con Gitlab
-
Error: sus cambios locales a los siguientes archivos se sobrescribirían mediante el pago:
-
Error cuando instalo SASS
-
logotipo de Apple en terminal
-
Error de pila detallada: [email protected] Instalación: `Node-pre-Gyp Install--Fallback-to-Build`
-
PI Desactivar SSH ADVERTENCIA
-
Error: No se puede encontrar una coincidencia: CentOS-LEENTE-OPENSTACK-ARS
-
AWS SSH Advertencia Archivo de clave privada sin protección
-
git recuerda iniciar sesión
-
Niveles de comando de árbol
-
Información del sistema Manjaro Linux
-
ADVERTENCIA: LF será reemplazado por CRLF en [file_path]
-
Kubectl Live Logs
-
Docker Regists Últimas líneas
-
Error de Heroku: SRC RefSpec Master no coincide con ninguna
-
Error de WebView de instalación de PIP
-
Cómo cerrar sesión en Linux Kali
-
Bash continúa con el error
-
@ ADVERTENCIA: ¡Archivo de clave privada sin protección! @
-
Deshabilitar los registros del enrutador Heroku
-
Verifique la configuración de Logstash
-
registros de límite de composición de Docker
-
Error: eacces: permiso denegado, mkdir
-
Error al conectarse al repositorio: Error al realizar el comando git: git ls -remote -h
-
No se pudo instalar el paquete Expo con error: YARNPKG salió con código distinto de cero: 1 yarnpkg salido con código distinto de cero: 1
-
Obtenga registros de la aplicación no
-
Iniciar sesión Iniciar sesión en git
-
Ubuntu PSQL: Error: fatal: la autenticación de pares falló para el usuario
-
Tratar las advertencias como errores porque process.env.ci = true. github
-
shell lógico y para la existencia del archivo
-
Docker: Respuesta de error de Daemon: Pull Access denegado para
-
Docker todos los registros a la vez
-
Unicodedecodeerror
-
Error: Node Sass versión 7.0.1 es incompatible con ^4.0.0.
-
Pyinstaller no pudo ejecutar el error del script con la opción -Noconsole
-
Error de huellas digitales de Ubuntu
-
Exportar archivo gitlog
-
BASH: ENCUENTRA TODO EL ERROR A LA ANTERIZACIÓN
-
Edificio sin Cython. Error: asegúrese de que se instalen los paquetes de desarrollo libxml2 y libxslt.
-
cuadro de diálogo Respuesta de Docker
-
Conda Install lanza el error SSL
-
Git Lista de archivos solo hasta 1 niveles
-
registros de PM2
-
Instalar Error de almohada Alpine Linux
-
Arreglando los errores de construcción de iOS
-
SED Permitir el inicio de sesión de la raíz
-
Error de clon de Laravel Github
-
SED deshabilitar desactivando el inicio de sesión de la raíz
-
Error de OpenSSL con Ruby 2.3.4 en Ubuntu
-
Appium Inspector está recibiendo un error 304
-
Error de instalación del nodo El usuario autenticado no es válido
-
rmmod: error: el módulo nvidia_drm está en uso
-
Error: la rueda de construcción fallida para kiwisolver
-
Error de reconstrucción de nodo-gyp Ubuntu 20.04
-
¿Dónde están registrados los errores de PHP?
-
registros de la máquina del tiempo
-
Error de git: encabezado de paquete malo
-
Verifique el controlador de registro de contenedores
-
registros de depuración de MAMP Mac
-
registros de MAMP Mac PHP
-
No se pudo construir registro de registro Instalación de paquetes recopilados: registro en ejecución de configuración Setup.py para registrar ... Error
-
Docker-Compose: Error mientras carga bibliotecas compartidas: libz.so.1
-
Error: eaccess: permiso denegado iónico
-
Desactivar el servidor Ubuntu de inactivado
-
Eliminar archivelog sysdate-1
-
Error de Windows de NPM
-
Copiar archivos en Docker a Directorio da error
-
Error de instalación de Pycocotools
-
[PID = 9008] [ERR] Error: no hay variable de entorno de visualización especificada
-
MongoDB Administrador de inicio de sesión
-
Error al instalar el paquete en React 18
-
Cómo iniciar sesión como usuario raíz en Kubernetes POD
-
Error: falta la tecla requerida de la tecla
-
El usuario de Force-Logout Linux
-
Importor No hay módulo llamado Numpy Ubuntu
-
Error: Falta la configuración del complemento Servidor-Domain: la configuración del complemento.
-
No puede iniciar sesión en Kali Linux
-
Kali Linux no inicia sesión después de instalar Virtualbox
-
Pip Changelog
-
Docker Ingangin Dockerhub
-
Docker Regists
-
ruta de host de los registros de contenedores de Docker
-
Carpeta de registros de SharePoint
-
Error de sintaxis de shell script final inesperado del archivo
-
Kubectl Logs Tail 100
-
Inicie sesión en el registro de Docker desde la terminal
-
GH Iniciar sesión con Github
-
Comando de inicio de sesión de NPM
-
No se pudo instalar paquetes debido a un entorno: [WinErerror 5] se niega el acceso
-
No se pudo instalar paquetes debido a un entorno: [WinErerror 5] El acceso se niega:
-
Instalación del agente de instancia de AWS en la línea de comandos (CloudWatchLogs)
-
Información sobre los archivos Linux
-
Mensaje de error del sistema Ubuntu
-
Error de git: OpenSSL ssl_connect: ssl_error_syscall en relación con github.com:443
-
Error: no se puede encontrar el módulo
-
Logs de Kubectl con Grep
-
Error: no se puede realizar un inicio de sesión interactivo desde un dispositivo no TTY
-
SSH Iniciar sesión sin Passowrd
-
ADVERTENCIA: Tirar sin especificar cómo reconciliar las ramas divergentes se desaconseja
-
Statsmodels Función logit
-
Error de Android/Gradlew Eacces
-
Linux du supresión de errores
-
FATAL: No se puede acceder a acceder a la configuración del error Certificado Verificar ubicaciones CA-Bundle.CRT Capath: Ninguno
-
SSM Terraform Iniciar sesión en EC2
-
Error de Windows de fibras npm
-
Salida del comando de Linux Logrotate
-
Errores durante la descarga de metadatos para el repositorio
-
Error de comando desconocido de aumento
-
GAMMU-SMSD.Service: la configuración de la unidad tiene un error fatal, la unidad no se iniciará.
-
error nginx dompdf
-
bash_logout
-
yp-rim-stack-orror-access-permission-mkdir-var-www-project-name-no
-
Cómo verificar los registros de Docker-Compose
-
Actualizar el compositor en Mac para resolver el error de verificación SSL
-
Volatilidad 3 ImageInfo
-
Error a instalar una vaina - error de bus al 0x00000001045b8000
-
Error al cargar WebView vscode ubuntu
-
Registros de servicio de reloj de popa
-
Inicio de sesión del usuario de Drush
-
Windows abre inicio de sesión sin contraseña
-
Error de instalación de MySQL2 Ruby
-
Recargar la configuración automática de Logstash
-
Error: no se encontró distribución coincidente para la antorcha.fx
-
Problemas de dependencia: se encontraron errores no configurados mientras se procesaron:
-
AWS CodeDePloy Logs
-
GDM de Ubuntu en el teclado de inicio de sesión deja de funcionar
-
El error de Splunk no puede crear prueba
-
NPM Instalar SASS-Loader Error
-
Cómo usar el controlador de registro de syslog en Kubernetes
-
Cómo usar la bandera Find y -regex juntas
-
Error: no puede hacer para Win32 y Target Squirrel: el fabricante declaró que no puede funcionar en Win32
-
Ejecutando la instalación de Setup.py para PyahocorAsick ... Error
-
LOGROTATE LINUX recursivo
-
Error: no se puede resolver el módulo
-
Intentando registrar Bundler :: GemFileError para el código de estado 4 Pero Bundler :: GemFileError ya está registrado
-
Corrige el error SSH en la terminal
-
Deshabilitar el registro en Linux
-
PS1 no se puede cargar porque ejecutar scripts está deshabilitado en este sistema. Para obtener más información, consulte Acerca de_Execution_Policies en
-
Synology Virtual Machine Instalar Agente
-
WhatsApp está instalado pero no instalado Error en Android
-
Bash Combine COMMAND DE EXIT Códigos de salida y salida para construir una lógica rápida
-
Se encontraron errores durante el procesamiento: Linux-IMage-5.4.0-71 Genérico Linux-Image-5.4.0-70 Generic
-
Mata la terminal de inicio de sesión de Debian
-
Ubuntu 19.10 Error de actualización de EOAN
-
Logitech G Hub no instalando Windows 10
-
Redirección de salida y error en Linux
-
Ubuntu Tar All .log y .txt
-
PIP Instale Error PSYCOPG2
-
STD Error Bash
-
Git falló con un error fatal. No se pudo leer la contraseña para
-
Error de Manjaro: no pudo bloquear la base de datos: existe el archivo
-
solicitar al usuario que cambie la contraseña en el primer inicio de sesión de Linux expire
-
Para verificar los registros en Ubuntu y Debian
-
Cómo crear un índice múltiple usando logstash
-
CentOS muestra información sobre los usuarios que actualmente están registrados.
-
k registros
-
Autologin Ubuntu 20.04 LightDM
-
Comando de error del escáner de mapache no encontrado
-
depurar logstash stdout
-
Iniciar sesión como raíz Debian
-
El error de rama de eliminación de git no se encuentra
-
Para copiar un archivo de B a un tiempo registrado en A:
-
Error de Letsencrypt
-
Mostrar mensaje de error y salir si $ foo es inseguro (o nulo)
-
Agregar grupo sin sesión
-
Redirigir archivos de error a diferentes archivos Linux
-
Instalar nodo sin fuerza de advertencia
-
bioinformática estructural de la tubería
-
Error: el servidor terminó temprano con el estado 127
-
-
GIT La URL solicitada devuelve Error: 403
-
def_daemon [19685]: Segfault en 7F4D6811B7F0 IP 00007F4D6811B7F0 SP 00007F4D65BCC808 Error 15
-
Docker Error 2 Las coincidencias que se encuentran en función de la red de nombres es ambiguo
-
ajustar barras de error de gnuplot
-
Error de dominio Letsencrypt
-
Cómo obtener la información del conductor Ubuntu
-
Autenticación de inicio de sesión en Android usando Volley Github
-
Iniciar sesión en GitHub desde la terminal
-
Debian logrotate mail.log monatamente
-
Error de Ubuntu SSL No ha elegido confiar en la autoridad de certificación de conflicto - G2
-
Cómo corregir el error no puede cambiar el directorio de trabajo
-
atacar errores silenciosos
-
Recargar SWI Prolog
-
ruta de registros de Docker
-
GitHub de repente da un error de archivo grande
-
Systemd espera a que finalice el servicio antes de iniciar sesión
-
Git Advertencia LF será reemplazado por CRLF
-
Error: repositorio no encontrado. FATAL: Konnte Nicht Vom Remote-Reppository Lesen. Bitte stellen sie sicher, dass die korrekten zugriffsberechtigungu bestehen und das repositorio existente.
-
Inicie sesión en Linux Server desde Windows Putty
-
¿Cuál es la ID de inicio de sesión en masilla para Ubuntu?
-
Stderr: vboxmanage.exe: Error: UUID
-
Error de Crontab a NULL
-
Logitech M525 Linux Driver Ubuntu
-
NodeJs nueva versión error sobrescribir antigua
-
Error de PIP install Pywhatkit
-
Información informática de PowerShell
-
SSH Permitir la subred de inicio de sesión de contraseña
-
Mensaje de inicio de sesión en Mac
-
Error fatal: contratado. H: Aucun Fichier ou dossier de ce tipo
-
Git Advertencia redirigiendo a
-
PARSE JSON REGRESS EN LOKI, PROMTAIL
-
Error: para build_env no puede crear contenedor para el servicio build_env: create.: El nombre del volumen es demasiado corto, los nombres deben ser al menos dos caracteres alfanuméricos
-
Requestsdependencyurning chardet
-
Error de protocolo: el nombre de archivo no coincide con la solicitud
-
Cómo verificar los registros de IIS para el tiempo de reciclaje de la agrupación de aplicaciones
-
SQLMAP Enumerate Bases de datos para la página de inicio de sesión
-
Error fatal: Jansson.h: Aucun Fichier OU Dossier de CE Tipo
-
Información del sistema de Terminal Linux
-
Error de comando de cp bash con paréntesis
-
AWS Elastic Container Service inicio de sesión
-
Cómo resolver la marca de tiempo está en el futuro error cuando desempaquete un archivo de alquitrán en un sistema donde el reloj está detrás del reloj del sistema en el que creó el archivo de alquitrán.
-
Docker Compose Logs Container Stdout
-
Buen lote Iniciar sesión
-
dpkg: paquete de procesamiento de errores nginx (--configure): problemas de dependencia-dejando no configurado
-
DPKG: paquete de procesamiento de errores libc-bin (-configure): paquete de libc-bin instalado subprocesamiento de subproceso devuelto Error de salida Estado 134
-
Cómo cerrar sesión Dockerhub
-
Se corrigieron los errores durante la actualización en Linux
-
Error VIM en Ubuntu
-
PowerShell Get-Aduser Global Catálogo
-
Rune ilegal literal (y 1 errores más)
-
Listas de paquetes de lectura ... terminado de construcción de la dependencia del árbol de lectura Información del estado ... Hecho E: No se puede localizar el paquete Nano
-
carpeta Nlog Linux
-
var/lib/dpkg/info/ubuntu-advantage-tools.prerm: py3clean: no encontrado
-
¿Qué puedo hacer con el error que no puedo emitir certificado clon git?
-
Se produjo un error al instalar Capybara-Webkit (1.15.1), y Bundler no puede continuar.
-
Se corrigieron los errores al instalar un archivo en Linux
-
Configurar: Error: *** Posix Caps Headers no encontrado
-
Error: Error: RPMDB Open falló
-
Script de paquete libc-bin instalado subprocesamiento devuelto Error Error Estado de salida 134
-
React Material-UI Instalar error en React 18
-
Laravel Mix no ha referenceError: Babelhelpers no está definido
-
sslkeylogfile no funciona Linux
-
Ubuntu syslog.2.gz
-
Permiso denegado en /var /iniciar sesión en Ubuntu
-
Filtrar en PowerShell Win32_nteventLogFile
-
Error: Error de transacción no se pudo
-
Obtenga registros de ramas Git locales
-
Como hacer para loguearse en git en visual
-
ssh_askpass: posix_spawnp: error desconocido
-
comando de registrador a syslog remoto
-
Heroku config: set npm_config_production = false yarn_production = falso error
-
Ejemplo de archivo de archivo YAML Error de Ubuntu NetPlan
-
Agente de reloj en la nube para registros y uso de Pstore
-
Uso de SED para encontrar y reemplazar cadena compleja (preferiblemente con regex)
-
Error mientras gobierna más bonito
-
Error desde el servidor: Error Backend de marcación: Marque TCP: 10250: Conecte: No hay ruta al host Kubernetes
-
R PAQUETES DE INSTALACIÓN Error de exportación al cliente
-
Error interno cerrado: no se puede crear un directorio temporal
-
Mac Workbench Error de carga de contenido de esquema 1558
-
Ignorar todos los registros
-
Instale GrayLog para PFSense en Centos 8
-
Salida de script de Ubuntu Bash cuando Error
-
Ejecutar logrotado específico
-
Corrige el error de red Docker y los contenedores de Windows
-
Error de permiso de eacces denegado mkdir xampp ubuntu
-
Systemerror: dispositivo GPU no encontrado Sitio: stackoverflow.com
-
Cómo poner acceso. Log en Gitignore
-
Empuje mis registros a Elk usando fileBeat
-
shell de diálogo sí/no
-
RSYSLOGD Verificar el servicio se ejecuta
-
PY PIP Instale Error WinError El sistema no puede encontrar el .exe.deleteme
-
Regex: coincida con la última aparición, también conocida como negativa, lookbehind
-
Advertencia: se encontraron enlaces simbólicos rotos. Retírelos con Brew Cleanup`:
-
Estado de salida de error de subproceso previo a la resolución de retroceso 127
-
Errores: Grub-Efi-AMD64 firmado
-
Configurar syslog-ng docker
-
Los niveles de Linux DF -H ocupan
-
Bash verificación de retorno del comando no error
-
Registros de Android para la aplicación en la terminal
-
no es un error fatal de repositorio de git
-
Permiso de error digital Ocear denegado (PublicKey).
-
Error: Error Instalación de Jekyll: Error: Error al construir Gem Native
-
Error: RPC falló; Curl 56 Gnutls Recv Error (-110): la conexión TLS se terminó de manera no cerrada.
-
El trabajo para redis-server.service falló porque el proceso de control salió con el código de error.
-
Error Instalado React Native usando NPX React Native Init
-
Se encontraron errores durante el procesamiento: Ubuntu
-
Salida de registro en scripts bash
-
Error: permiso insuficiente para agregar un objeto a la base de datos del repositorio
-
loggy.sh android
-
Twisted.internet.error.reactoraLeadeInstalledError: Reactor ya instalado [5804] no pudo ejecutar el script principal
-
Ubuntu Update VersionsCaricamento Delle Informazioni Del Repository Non Riuscito Controllare La Propria Connessione A Internet.
-
Error al instalar dkphotogallery en xcode
-
Vista de registros de instalación de NPM
-
NG Servir --- MG: Error fundamental del servidor
-
Agregue el usuario registrado al sitio del grupo de administradores locales Powershell Sitio: www.reddit.com
-
anterior.
-
Hyper-V mobylinuxvm primario ubuntu ¿Cuál es el inicio de sesión?
-
Explore las respuestas de código populares por idioma
Explorar otros lenguajes de código