“Error al cargar el módulo MySQLDB.” Código de respuesta
Respuestas similares a “Error al cargar el módulo MySQLDB.”
Preguntas similares a “Error al cargar el módulo MySQLDB.”
Más respuestas relacionadas con “Error al cargar el módulo MySQLDB.” en Sql
-
Código de error: 1175. Está utilizando el modo de actualización segura e intentó actualizar una tabla sin un lugar donde use una columna clave. Para deshabilitar el modo seguro, alterne la opción en preferencias -
-
Error 1819 (HY000): su contraseña no cumple con los requisitos de política actuales
-
Error fatal: libpq-fe.h: no hay dicho archivo o directorio
-
Importor No hay módulo llamado MySQL.Connector Raspberry Pi
-
Importor: ningún módulo llamado MySQL.Connector
-
Error SQL FK
-
PSQL: Error: no se pudo conectar al servidor: no hay dicho archivo o directorio
-
alembic.util.exc.commanderror: la base de datos de destino no está actualizada.
-
AssertionError [err_assertion]: Iferror obtuvo una excepción no deseada: ER_NOT_Supported_Auth_Mode: el cliente no admite el protocolo de autenticación solicitado por servidor; Considere actualizar la respuesta del código del cliente MySQL
-
PostgreSQL privilegio insuficiente: 7 Error: permiso denegado por la tabla
-
[2021-10-05T13: 43: 48.961Z] Error de error: ER_NOT_Supported_Auth_Mode: el cliente no admite el protocolo de autenticación solicitado por servidor; Considere actualizar el cliente MySQL
-
.... ¡ERROR! El servidor renuncia sin actualizar el archivo PID mysql centos
-
elevar el error de aplicación en Oracle
-
Configurar: Error: no se puede encontrar libpq-fe.h. Especifique la ruta correcta de instalación de PostgreSQL
-
Oserror: mysql_config no encontrado
-
Oserror: mysql_config no encontrado mysql_config --version mariadb_config --version mysql_config-libs --------------------------------- ------- Error: comando errado con el estado de salida 1: python setup.py Egg_info Verifique los registros para la salida completa del comando.
-
Código de error 1175 MySQL Fix
-
PIP instale el error de mysqlclient
-
Error de contraseña de MySQL Crear datbase
-
Código de error 1292 MySQL Workbench
-
Error de MQTT: Dirección no disponible
-
error mysql 8 al identificado por
-
El trabajo para mysql.service falló porque el proceso de control salió con el código de error.
-
Error 1290 (hy000): el servidor MySQL se está ejecutando con la opción --segure-archivo -priv para que no pueda ejecutar esta declaración
-
Crear base de datos DB; ErrorDeSintáxis: Identificador Inesperado
-
Error de shell MySQL: no conectado.
-
LoadError: no puede cargar dicho archivo - mysql2/2.7/mysql2
-
Error 1451 (23000): no se puede eliminar o actualizar una fila principal: falla una restricción de clave extranjera
-
un error SQL de error específico de red o instancia
-
org.h2.jdbc.jdbcsqlsyntaxerrorexception tabla no encontrada
-
org.h2.jdbc.jdbcsqlsyntaxerrorexception
-
Se produjo un error al instalar MySQL2 (0.5.3)
-
MySqldump: Got Got Error: 1045: Acceso denegado para el usuario
-
Error no abierto: no se puede usar el objeto de tipo mysqli_result como matriz
-
Error mySQL incompatible con sql_mode = solo_full_group_by
-
MySQL Error CodeInigniter
-
11:04:35 PM [MySQL] Error: MySQL Subpatedown inesperadamente.
-
11:04:35 PM [MySQL] Error: MySQL Subpatedown inesperadamente. 11:04:35 pm [mySQL] Esto puede deberse a un puerto bloqueado, dependencias faltantes,
-
sqlalchemy.exc.operationalError: (sqlite3.operationalError) No se puede abrir el archivo de la base de datos
-
Se produjo un error al instalar MySQL2 (0.3.20), y Bundler no puede continuar.
-
Error de cobro de MySQL
-
Error de lanzamiento de SQL
-
Postgres: Error: División por cero
-
Código de error 1451 SQL
-
Laravel General Error 2006 MySQL Server se ha ido
-
1396 (HY00) Error MySQL
-
django.db.utils.operationalError: no hay tal tabla:
-
Error de MySQL 1251
-
Error de SQL 1040: Demasiadas conexiones
-
MySQL Update Column Valor predeterminado Valor Current_Timestamp Error
-
ValueError: una cadena literal no puede contener caracteres NUL (0x00).
-
RaisError Nowait SQL Server
-
Error de grupo en MySQL
-
SQLSTATE [HY000]: Error general: 1215 no puede agregar restricción de clave extranjera
-
El código de error 1215 no puede agregar restricción de clave extranjera
-
MySQL identificado por error de sintaxis
-
Error 1064 (42000)
-
Raiserror con Nowait
-
Installado MySQL-Server-8.0 Paquete Postinstalation Script Subprocesamiento devuelto Error de salida ESTADO 1
-
Error de sintaxis o violación de acceso: 1701 no puede truncar una tabla referenciada en una restricción de clave extranjera
-
Error de Pgadmin Postgres: otros usuarios acceden a la base de datos.
-
EnvironmentError: mysql_config no encontrado
-
Sqlstate [42000]: error de sintaxis o violación de acceso: 1140 mezcla de columnas de grupo (min (), max (), count (), ...) sin columnas de grupo es ilegal si no hay grupo por cláusula
-
PSQL: Error: fatal: la autenticación de pares falló para el usuario
-
Error de mysqlclient
-
Importador: la carga DLL falló al importar _sqlite3: no se pudo encontrar el módulo especificado.
-
Error de sintaxis o violación de acceso: 1075 Tabla incorrecta DEF INITITION; solo puede haber una columna automática y debe definirse como una clave
-
Oracle No se encontró datos Código de error
-
Reemplace el error de división por cero con 0 en SQL
-
Error de MySQL 1114 (hy000) La tabla está llena
-
línea de compilación de errores de Oracle
-
Oracle Mostrar número de línea de error
-
Compilación de errores de Oracle Show
-
Oracle Show Errores
-
línea de error de Oracle
-
PG :: ExtrayKeyViolation: Error: Actualizar o eliminar en la tabla viola la restricción de clave extranjera
-
stream_socket_enable_crypto (): la operación SSL falló con el código 1. Mensajes de error OpenSSL: Error: 1416F086: Rutinas SSL: TLS_Process_Server_Certificate: Certificado Verificar
-
dividir por error cero en SQL
-
Se produjo un error al instalar MySQL (2.9.1), y Bundler no puede continuar
-
Código de error 1241 mysql
-
PG_RESTORE: Error: el archivo de entrada parece ser un volcado de formato de texto. Utilice PSQL.
-
IntegrityError en el valor de clave duplicada viola el detalle de restricción único: la identificación de clave ya existe.
-
Error de MySQL 1452
-
Error Infor en SQL Server
-
Falta Error de paréntesis de izquierda en SQL
-
Error: permiso denegado para cuentas de tabla PostgreSQL 13
-
MySQLIMPORT: Error: 4166
-
Error de conexión del servidor SQL VSCODE
-
Obtener un error al ejecutar el script de 50 MB en SQL Server
-
EneratingschemaError: se produjeron algunos errores al generar esquema GraphQL: la consulta de tipo debe definir uno o más campos.
-
Crear tabla con error
-
Error de guión en la base de datos MySQL
-
Crear tabla como Seleccionar error de SQL Server
-
reemplazo de mysql_error
-
Ran Rails DB: Migrate y Got == 20210620104415 DevisecreateUsers: Migrating =================================== - create_table (::: Usuarios) Rails abortados! StandardError: se ha producido un error, esta y todas las migraciones posteriores canceladas: SQLITE3 :: SQLE
-
Obtener datos de MySQLDB
-
Código de error MySQL 2068
-
Error de Laravel SQLSTATE [Hy000] [2002] Nenhuma Ligao Pde Ser Feita Porque O CompuTador de Destino como Ativamento de recuso
-
Error de MySqldump--No-Beep
-
Error E11000
-
Parent: [Error: SQLite_readonly: intente escribir una base de datos Readonly] {
-
Código de error de MySQL: 1005
-
Error SQL Al insertar valores duplicados
-
Falta el índice para el error de restricción en MySQL
-
org.h2.jdbc.jdbcsqlsyntaxerrorexception: error de sintaxis en la instrucción SQL
-
Error de restauración de la base de datos
-
Error: conecte EconnRefused 127.0.0.1:5432 en tcpconnectwrap.afterconnect [como onComplete] (net.js: 1148: 16
-
Error de SSL APACHE2
-
Sigue recibiendo un error cuando intento conectarme a MySQL Workbench
-
Cómo habilitar Squiggles de error en VS Código
-
Cómo leer los mensajes de error de potencia en el paquete SSIS
-
Sqlserverexception.makeFromDatabaseError
-
Error de MySQL 1215
-
Insertar valores con Beekeeper Get Error NULL Value en la columna creada en la restricción no nula
-
ORA 00001 Error Catch PLSQL
-
de . import _mysql ImporterRor: libmariadb.so.3: No se puede abrir el archivo de objeto compartido: no hay dicho archivo o directorio Linux
-
Error oculto SQL Codeigniter 3
-
Error al llamar al procedimiento del procedimiento
-
Error fatal no se ha insignado mysqli_sql_exception
-
Error de conexión MySQL
-
Error de SQL 1175
-
Programa PLSQL simple ejecutado en Oracle SQL Developer pero recibió el error
-
Desde _sqlite3 import * ImporterRor: Dll Load Faily: Das Angegebene Modul Wurde Nicht Gefunden.
-
Error de clave principal de SQL
-
Localhost Error 2006 (hy000) en la línea 1163: el servidor MySQL se ha ido
-
Error: 1408f10b: rutinas SSL: SSL3_GET_RECORD: número de versión incorrecto
-
El recuento de columnas de error mySQL de MySQL.User está mal. Esperado 45, encontrado 43. La tabla probablemente esté dañada en la consulta.
-
Error 1054 mysql
-
Seleccione SQLite3.OperationalError: No hay tal columna:
-
Error de autenticación de SQL
-
MySQL Use error de contraseña
-
Conexión de la base de datos de errores
-
OSError mysql_config no encontrado virtualenv
-
MySQL Error 1064 tiene un error en su sintaxis SQL
-
cursor.execute (sql, valor) valueError: el parámetro de operación debe ser STR
-
El acceso de error a la tabla del sistema innodb es rechazado
-
mysql phpmyadmin mysqli_construct :: Error para usuarios de Mac
-
Mysql típico
-
Descargar Snowsql para Linux
-
AJAX Error Exception Handeling
-
Valor de fecha de fecha incorrecto SQL Tabla Error 1292
-
Error el apagado de MySQL inesperadamente
-
IDE1006 (violación de la regla de nombres) Problema de error
-
Actualizar sqlaclehmy sqlalchemy.orm.evaluator.unevaluatableError: No se puede evaluar la expresión binaria con el operador
-
Error en conexión_import_file (conn@ptr, nombre, valor, sep, eol, omitir): rs_sqlite_import: test.csv línea 2 esperadas 11 columnas de datos pero encontradas 1
-
Explore las respuestas de código populares por idioma
Explorar otros lenguajes de código